{"text_format":"1","workbook":"xlsx","n_sheets":7,"sheets":["INSTRUCTIVO","DATOS UT","MIEMBROS","NO MIEMBROS","IMPRIMIR","LISTADOS","BD-GRAL"],"not_rendered":{"charts":0,"images":0,"macros":1,"external_links":0,"defined_names":4,"comments":0,"pivot_tables":0},"unopened":[],"bounds":{"document_bytes":16777216,"sheet_cells":100000,"rows_first":2000,"rows_last":500,"rows_between":2000,"halvings":0,"cell_chars":16384,"cell_head_chars":4096},"cells_cut":0,"cells_raw":0,"read":"whole","date_system":"1900"}

{"sheet":"INSTRUCTIVO","index":0,"n_rows":8,"n_cols":2,"rows_kept":8,"cut":false,"hidden":false,"merged":[[7,1,7,7],[24,1,24,7],[0,0,0,7],[5,1,5,7],[4,1,4,7],[6,1,6,7],[2,1,2,7],[3,1,3,7],[16,1,16,7],[19,1,19,7]]}
["INSTRUCCIONES DE LLENADO -POR FAVOR SEGUIR EL ORDEN-"]
[]
[1,"GUARDAR ARCHIVO:  ELEGIR LA OPCIÓN \"GUARDAR COMO\". PONER NOMBRE DE LA UNIÓN TRANSITORIA Y ELEGIR COMO TIPO: \"ARCHIVO EXCEL HABILITADO PARA MACRO\"."]
[2,"POSICIONARSE EN SOLAPA \"DATOS UT\", Y COMPLETAR DATOS."]
[3,"POSICIONARSE EN SOLAPA \"MIEMBROS\", Y COMPLETAR DATOS SEGÚN SEA MIEMBROS HUMANO/S O PERSONA/S. JURÍDICA."]
[4,"POSICIONARSE EN SOLAPA \"NO MIEMBROS\". Para el caso que exista miembros de los órganos de representación, administración y/o fiscalización que NO sean MIEMBROS."]
[5,"POSICIONARSE EN SOLAPA \"IMPRIMIR\". DEBE PRESIONAR PRIMERO LOS BOTONES UNO (1º) E IMPRIMIR -IR A LA SOLAPA SUPERIOR DE LA HOJA \"ARCHIVO\" y elegir opción \"IMPRIMIR\"-"]
[6,"UNA VEZ IMPRESA FIRMAR EN TODAS LAS PÁGINAS LOS MIEMBRO/AS, REP. LEGALES, GESTOR, APODERADO/A, ESCRIBANO/A, Y NO MIEMBROS INTERVINIENTES. LA FIRMA SE DEBE CERTIFICAR POR ANTE SECRETARIO DEL REGISTRO PUBLICO DE COMERCIO, O JUEZ DE PAZ,"]

{"sheet":"DATOS UT","index":1,"n_rows":37,"n_cols":12,"rows_kept":37,"cut":false,"hidden":false,"merged":[[18,5,18,6],[19,5,19,6],[17,5,17,6],[35,5,35,7],[36,5,36,7],[30,5,30,6],[32,5,32,6],[29,5,29,7],[31,5,31,7],[20,5,20,6],[21,5,21,6],[22,5,22,6],[23,5,23,6],[24,5,24,6],[33,5,33,7],[34,5,34,7],[26,0,28,0],[26,1,28,1],[26,2,28,2],[26,3,26,4],[27,3,28,3],[27,4,28,4],[9,3,9,4],[10,3,10,4],[11,3,11,4],[12,3,12,4],[13,3,13,4],[2,0,2,4],[3,0,3,2],[1,0,1,4],[6,3,8,4],[6,0,8,0],[6,1,8,1],[3,3,3,5],[4,4,4,5],[6,2,8,2]]}
["DATOS UNIÓN TRANSITORIA - act 2018/10"]
["(COMPLETAR CELDAS CON FONDO VERDE)"]
["Juzgado Pcial 1era. Inst. en lo Civil, Comercial, Laboral y de Minería nro. UNO, Secretaría Registro Público de Comercio de Río Gallegos –Marcelino Alvarez 113, CP 9400-"]
["NOMBRE DE LA UNIÓN TRANSITORIA:"]
[null,null,"FECHA:",null,{"$f":"+IF(D5=0,\"CAMPO OBLIGATORIO, CAUSAL DE RECHAZO\",\"\")","v":"CAMPO OBLIGATORIO, CAUSAL DE RECHAZO"}]
["ANEXO I (GESTIÓN/TRÁMITE)       "]
["REFER.","APELLIDO/s DEL GESTIONANTE","NOMBRE/s DEL DEL GESTIONANTE","DATOS"]
[]
[]
[]
[]
[]
[]
[]
[null,null,null,null,"COMPLETAR"]
[null,null,null,"CONCEPTO"]
[null,null,null,null,"-EN MAYUSCULA -"]
["aa GESTOR",null,null,"TRAMITE QUE SE INICIA:","ELEGIR",{"$f":"+IF(OR(B18=0,C18=0),\"FALTA APELL/NOMB DEL GEST, CAUSAL DE RECHAZO\",\"\")","v":"FALTA APELL/NOMB DEL GEST, CAUSAL DE RECHAZO"},null,null,null,null,null,1]
["ab GESTOR",{"$f":"B$18","v":0},{"$f":"C$18","v":0},"DOMICILIO PROCESAL CONSTITUIDO -art.40 CPCC-:",null,{"$f":"+IF(E19=0,\"CAMPO OBLIGATORIO, CAUSAL DE RECHAZO\",\"\")","v":"CAMPO OBLIGATORIO, CAUSAL DE RECHAZO"},null,null,null,null,null,2]
["ac GESTOR",{"$f":"B$18","v":0},{"$f":"C$18","v":0},"CARÁCTER DEL GESTIONANTE:",null,{"$f":"+IF(E20=0,\"CAMPO OBLIGATORIO, CAUSAL DE RECHAZO\",\"\")","v":"CAMPO OBLIGATORIO, CAUSAL DE RECHAZO"},null,null,null,null,null,3]
["ad GESTOR",{"$f":"IF(OR($E$20=\"ESCRIBANO/A\",$E$20=\"APODERADO/A LETRADO/A\"),0,$B18)","v":0},{"$f":"IF(OR($E$20=\"ESCRIBANO/A\",$E$20=\"APODERADO/A LETRADO/A\"),0,$C18)","v":0},{"$f":"IF(OR(E$20=\"ESCRIBANO/A\",E$20=\"APODERADO/A LETRADO/A\"),\"\",\"LETRADO/A/S PATROCINANTE/S:\")","v":"LETRADO/A/S PATROCINANTE/S:"},null,{"$f":"+IF(D21=\"\",\"\",IF(E21=0,\"CAMPO OBLIGATORIO, CAUSAL DE RECHAZO\",\"\"))","v":"CAMPO OBLIGATORIO, CAUSAL DE RECHAZO"},null,null,null,null,null,4]
["ae GESTOR",{"$f":"IF(OR($E$20=\"ESCRIBANO/A\",$E$20=\"APODERADO/A LETRADO/A\"),0,$B19)","v":0},{"$f":"IF(OR($E$20=\"ESCRIBANO/A\",$E$20=\"APODERADO/A LETRADO/A\"),0,$C19)","v":0},{"$f":"IF(OR(E$20=\"ESCRIBANO/A\",E$20=\"APODERADO/A LETRADO/A\"),\"\",\"DOC. IDENTIDAD –sin puntos-:\")","v":"DOC. IDENTIDAD –sin puntos-:"},null,{"$f":"+IF(D22=\"\",\"\",IF(E22=0,\"CAMPO OBLIGATORIO, CAUSAL DE RECHAZO\",\"\"))","v":"CAMPO OBLIGATORIO, CAUSAL DE RECHAZO"},null,null,null,null,null,5]
["af GESTOR",0,0,{"$f":"IF(OR(E$20=\"ESCRIBANO/A\",E$20=\"APODERADO/A LETRADO/A\"),\"\",\"DOMICILIO REAL -indicar Ciudad/Pcia./País\")","v":"DOMICILIO REAL -indicar Ciudad/Pcia./País"},null,"CAMPO OBLIGATORIO, CAUSAL DE RECHAZO",null,null,null,null,null,6]
["ag GESTOR",0,0,{"$f":"IF(OR(E$20=\"ESCRIBANO/A\",E$20=\"APODERADO/A LETRADO/A\"),\"\",\"CEL/TEL -c/código de área, sin puntos o barras-:\")","v":"CEL/TEL -c/código de área, sin puntos o barras-:"},null,"CAMPO OBLIGATORIO, CAUSAL DE RECHAZO",null,null,null,null,null,7]
["ah GESTOR",0,0,{"$f":"IF(OR(E$20=\"ESCRIBANO/A\",E$20=\"APODERADO/A LETRADO/A\"),\"\",\"EMAIL -OBLIGATORIO-:\")","v":"EMAIL -OBLIGATORIO-:"},null,"CAMPO OBLIGATORIO, CAUSAL DE RECHAZO",null,null,null,null,null,8]
["ANEXO II -DATOS DE LA UNIÓN TRANSITORIA-"]
["REFER.","NOMBRE UNIÓN TRANSITORIA","NOMBRE UNIÓN TRANSITORIA","DATOS"]
[null,null,null,"CONCEPTO","COMPLETAR -EN MAYUSCULA -"]
[]
["ba UNIÓN TRANSITORIA",{"$f":"$D$4","v":0},{"$f":"$D$4","v":0},"DIRECCION domicilio legal:",null,{"$f":"+IF(E30=0,\"CAMPO OBLIGATORIO, CAUSAL DE RECHAZO\",\"\")","v":"CAMPO OBLIGATORIO, CAUSAL DE RECHAZO"}]
["ba UNIÓN TRANSITORIA",{"$f":"$D$4","v":0},0,"CUIT –sin puntos ni barras-:"]
["ba UNIÓN TRANSITORIA",0,0,"FONDO COMÚN OPERATIVO -en pesos o moneda convenida-:",null,{"$f":"+IF(E32=0,\"CAMPO OBLIGATORIO, CAUSAL DE RECHAZO\",\"\")","v":"CAMPO OBLIGATORIO, CAUSAL DE RECHAZO"}]
["ba UNIÓN TRANSITORIA",0,0,"CAPITAL MÍNIMO A INTEGRAR TOTAL (SOCIOS DE ESTE FORM):",{"$f":"+MIEMBROS!#REF!+MIEMBROS!E51+MIEMBROS!E73+MIEMBROS!E95+MIEMBROS!E117+MIEMBROS!E139+MIEMBROS!E161+MIEMBROS!E183+MIEMBROS!E205+MIEMBROS!E227+MIEMBROS!E249+MIEMBROS!#REF!+MIEMBROS!#REF!+MIEMBROS!#REF!+MIEMBROS!#REF!+MIEMBROS!J43+MIEMBROS!J60+MIEMBROS!J77+MIEMBROS!J94+MIEMBROS!J111+MIEMBROS!J128+MIEMBROS!J145+MIEMBROS!#REF!+MIEMBROS!#REF!","v":{"$error":"#REF!"}},{"$f":"+IF(E33=0,\"CAMPO OBLIGATORIO, CAUSAL DE RECHAZO\",\"\")","v":{"$error":"#REF!"}}]
["ba UNIÓN TRANSITORIA",0,0,"FECHA DE CELEBRACIÓN DEL CONTRATO:",null,"CAMPO OBLIGATORIO, CAUSAL DE RECHAZO"]
["ba UNIÓN TRANSITORIA",0,0,"FECHA DE FINALIZACIÓN DEL CONTRATO:",null,"CAMPO OBLIGATORIO, CAUSAL DE RECHAZO"]
["ba UNIÓN TRANSITORIA",0,0,"CEL/TEL (de administración) -en su caso indicar que no posee-:",null,{"$f":"+IF(E36=0,\"CAMPO OBLIGATORIO, CAUSAL DE RECHAZO\",\"\")","v":"CAMPO OBLIGATORIO, CAUSAL DE RECHAZO"}]
["ba UNIÓN TRANSITORIA",0,0,"EMAIL (de administración)  -en su caso indicar que no posee-:",null,"CAMPO OBLIGATORIO, CAUSAL DE RECHAZO"]

{"sheet":"MIEMBROS","index":2,"n_rows":267,"n_cols":10,"rows_kept":267,"cut":false,"hidden":false,"merged":[[7,8,7,10],[8,8,8,10],[9,9,9,10],[1,0,1,4],[2,0,2,4],[3,0,3,2],[3,3,3,4],[6,8,6,9],[6,0,8,0],[6,6,8,6],[5,0,5,4],[5,6,5,9]]}
[{"$f":"+'DATOS UT'!A1","v":"DATOS UNIÓN TRANSITORIA - act 2018/10"}]
["(COMPLETAR CELDAS CON FONDO VERDE)"]
["Juzgado Pcial 1era. Inst. en lo Civil, Comercial, Laboral y de Minería nro. UNO, Secretaría Registro Público de Comercio de Río Gallegos –Marcelino Alvarez 113, CP 9400-"]
["NOMBRE DE LA UNIÓN TRANSITORIA:",null,null,{"$f":"+'DATOS UT'!D4:E4","v":0}]
[null,"FECHA:",{"$f":"+'DATOS UT'!D5","v":"00:00:00"}]
["DATOS MIEMBROS PERSONAS HUMANAS",null,null,null,null,null,"DATOS MIEMBROS PERSONAS JURÍDICAS"]
["REFER.","APELLIDO/s DEL MIEMBRO","NOMBRE/s DEL MIEMBRO","DATOS",null,null,"REFER.","RAZON SOCIAL/DENOMINACIÓN MIEMBRO PERSONA JURÍDICA","DATOS"]
[]
[]
[null,null,null,null,null,null,null,null,null,"XX SA"]
[]
[]
[null,null,null,null,"COMPLETAR"]
[null,null,null,"CONCEPTO"]
[null,null,null,null,"-EN MAYUSCULA -"]
["c MIEMBRO PH",null,0,"DOC. IDENTIDAD –sin puntos-:",null,null,"c MIEMBRO PJ",null,"CUIT –sin puntos ni barras-:"]
["c MIEMBRO PH",{"$f":"+B16","v":0},{"$f":"+C16","v":0},"CUIT/CUIL –sin puntos ni barras-:",null,null,"c MIEMBRO PJ",{"$f":"H16","v":0},"TIPO DE PERSONA JCA -UNIÓN TRANSITORIA, asociación, mutual, etc-:"]
["c MIEMBRO PH",{"$f":"+B17","v":0},{"$f":"+C17","v":0},"FECHA DE NACIMIENTO –dd/mm/aa-:",null,null,"c MIEMBRO PJ",{"$f":"H16","v":0},"ORGANISMO /s DONDE SE INSCRIBIÓ CONSTITUCIÓN (INDICAR LOCALIDAD/PCIA DEL ORG) -si no se inscribió poner: NO INSCRIPTO/A:"]
["c MIEMBRO PH",0,0,"LUGAR DE NACIMIENTO:",null,null,"c MIEMBRO PJ",{"$f":"IF(I19=\"\",0,H16)","v":0},{"$f":"IF(OR(J18=\"NO INSCRIPTO/A\",J18=\"NO INSCR.\", J18=\"NO INSCR\",J18=\"N/I\", J18= \"NO INSCRIPTO\",J18=\"NO INSCRIPTA\"),\"\",\"DATOS DE RESOLUCIÓN Y FECHA DE INSCRIPCIÓN:\")","v":"DATOS DE RESOLUCIÓN Y FECHA DE INSCRIPCIÓN:"}]
["c MIEMBRO PH",0,0,"NACIONALIDAD:",null,null,"c MIEMBRO PJ",{"$f":"IF(I20=\"\",0,H16)","v":0},{"$f":"IF(I19=\"\",\"\",\"FECHA DE INSCRIPCION:\")","v":"FECHA DE INSCRIPCION:"}]
["c MIEMBRO PH",0,0,"PROFESIÓN/OFICIO:",null,null,"c MIEMBRO PJ",{"$f":"H16","v":0},"APELLIDO/S, NOMBRE/S,  DNI Y CARGO DE CADA MIEMBRO DE SU ADMINISTRACIÓN:"]
["c MIEMBRO PH",0,0,"DOMICILIO REAL:",null,null,"c MIEMBRO PJ",{"$f":"IF(AND(J23>0,J22=0),0,H16)","v":0},"DOMICILIO SOCIAL:"]
["c MIEMBRO PH",0,0,"CEL/TEL :",null,null,"c MIEMBRO PJ",{"$f":"IF(AND(J22>0,J23=0),0,H16)","v":0},"SEDE SOCIAL:"]
["c MIEMBRO PH",{"$f":"IF(E24=0,0,B16)","v":0},{"$f":"IF(E24=0,0,C16)","v":0},"EMAIL:",null,null,"c MIEMBRO PJ",{"$f":"H16","v":0},"CEL/TEL :"]
["c MIEMBRO PH",{"$f":"B16","v":0},{"$f":"C16","v":0},"ESTADO CIVIL:",null,null,"c MIEMBRO PJ",{"$f":"H16","v":0},"OBJETO PRINCIPAL (EN FORMA RESUMIDA):"]
["c MIEMBRO PH",{"$f":"IF($E25=\"CASADO/A\",B16,0)","v":0},{"$f":"IF($E25=\"CASADO/A\",C16,0)","v":0},{"$f":"IF(E25=\"CASADO/A\",\"APELLIDO/S CÓNYUGE:\",\"\")","v":""},null,null,"d CONTRIB.",{"$f":"+H16","v":0},"CONTRIBUCIÓN -EN PESOS U OTRA MONEDA-:"]
["c MIEMBRO PH",{"$f":"IF($E25=\"CASADO/A\",B16,0)","v":0},{"$f":"IF($E25=\"CASADO/A\",C16,0)","v":0},{"$f":"IF(E25=\"CASADO/A\",\"NOMBRE/S CÓNYUGE:\",\"\")","v":""},null,null,"d CONTRIB.",{"$f":"H16","v":0},"PARTICIPACIÓN S/FONDO COMÚN OPERATIVO (%):",{"$f":"J26/'DATOS UT'!$E$32","v":{"$error":"#DIV/0!"}}]
["c MIEMBRO PH",{"$f":"IF($E25=\"CASADO/A\",B16,0)","v":0},{"$f":"IF($E25=\"CASADO/A\",C16,0)","v":0},{"$f":"IF(E25=\"CASADO/A\",\"DOC. IDENTIDAD (cónyuge) –sin puntos ni barras-:\",\"\")","v":""},null,null,"c MIEMBRO PJ",{"$f":"IF(J28=0,0,H16)","v":0},"NOTA/OBSERVACIÓN -en mayúscula-:"]
["g CONTRIB.",{"$f":"B16","v":0},{"$f":"B16","v":0},"CONTRIBUCIÓN -EN PESOS U OTRA MONEDA-:",null,null,"c MIEMBRO PJ",null,"CUIT –sin puntos ni barras-:"]
["f PARTICIPACION",{"$f":"+B16","v":0},{"$f":"+C16","v":0},"PARTICIPACIÓN S/FONDO COMÚN OPERATIVO (%):",{"$f":"E29/'DATOS UT'!$E$32","v":{"$error":"#DIV/0!"}},null,"c MIEMBRO PJ",{"$f":"H29","v":0},"TIPO DE PERSONA JCA -UNIÓN TRANSITORIA, asociación, mutual, etc-:"]
["i ORG. REP. LEGAL/ ADM.",{"$f":"IF(E31=0,0,B16)","v":0},{"$f":"IF(E31=0,0,C16)","v":0},"NOMBRE CARGO REP. LEGAL/ ADMINISTRACIÓN QUE OCUPA:",null,null,"c MIEMBRO PJ",{"$f":"H29","v":0},"ORGANISMO /s DONDE SE INSCRIBIÓ CONSTITUCIÓN (INDICAR LOCALIDAD/PCIA DEL ORG) -si no se inscribió poner: NO INSCRIPTO/A:"]
["j ORG. FISCALIZ.",{"$f":"IF(E32=0,0,B17)","v":0},{"$f":"IF(E32=0,0,C17)","v":0},"NOMBRE CARGO FISCALIZACIÓN QUE OCUPA:",null,null,"c MIEMBRO PJ",{"$f":"IF(I32=\"\",0,H29)","v":0},{"$f":"IF(OR(J31=\"NO INSCRIPTO/A\",J31=\"NO INSCR.\", J31=\"NO INSCR\",J31=\"N/I\", J31= \"NO INSCRIPTO\",J31=\"NO INSCRIPTA\"),\"\",\"DATOS DE RESOLUCIÓN Y FECHA DE INSCRIPCIÓN:\")","v":"DATOS DE RESOLUCIÓN Y FECHA DE INSCRIPCIÓN:"}]
["c MIEMBRO PH",{"$f":"IF(E33=0,0,B16)","v":0},{"$f":"IF(E33=0,0,C16)","v":0},"NOTA/OBSERVACIÓN -en mayúscula-:",null,null,"c MIEMBRO PJ",{"$f":"IF(I33=\"\",0,H29)","v":0},{"$f":"IF(I32=\"\",\"\",\"FECHA DE INSCRIPCION:\")","v":"FECHA DE INSCRIPCION:"}]
["c MIEMBRO PH",null,0,"DOC. IDENTIDAD –sin puntos-:",null,null,"c MIEMBRO PJ",{"$f":"H29","v":0},"APELLIDO/S, NOMBRE/S,  DNI Y CARGO DE CADA MIEMBRO DE SU ADMINISTRACIÓN:"]
["c MIEMBRO PH",{"$f":"+B34","v":0},{"$f":"+C34","v":0},"CUIT/CUIL –sin puntos ni barras-:",null,null,"c MIEMBRO PJ",{"$f":"IF(AND(J36>0,J35=0),0,H29)","v":0},"DOMICILIO SOCIAL:"]
["c MIEMBRO PH",{"$f":"+B35","v":0},0,"FECHA DE NACIMIENTO –dd/mm/aa-:",null,null,"c MIEMBRO PJ",{"$f":"IF(AND(J35>0,J36=0),0,H29)","v":0},"SEDE SOCIAL:"]
["c MIEMBRO PH",0,0,"LUGAR DE NACIMIENTO:",null,null,"c MIEMBRO PJ",{"$f":"H29","v":0},"CEL/TEL :"]
["c MIEMBRO PH",0,0,"NACIONALIDAD:",null,null,"c MIEMBRO PJ",{"$f":"H29","v":0},"OBJETO PRINCIPAL (EN FORMA RESUMIDA):"]
["c MIEMBRO PH",0,0,"PROFESIÓN/OFICIO:",null,null,"d CONTRIB.",{"$f":"+H29","v":0},"CONTRIBUCIÓN -EN PESOS U OTRA MONEDA-:"]
["c MIEMBRO PH",0,0,"DOMICILIO REAL:",null,null,"d CONTRIB.",{"$f":"H29","v":0},"PARTICIPACIÓN S/FONDO COMÚN OPERATIVO (%):",{"$f":"J39/'DATOS UT'!$E$32","v":{"$error":"#DIV/0!"}}]
["c MIEMBRO PH",0,0,"CEL/TEL :",null,null,"c MIEMBRO PJ",{"$f":"IF(J41=0,0,H29)","v":0},"NOTA/OBSERVACIÓN -en mayúscula-:"]
["c MIEMBRO PH",{"$f":"IF(E42=0,0,B34)","v":0},{"$f":"IF(E42=0,0,C34)","v":0},"EMAIL:",null,null,"c MIEMBRO PJ",null,"CUIT –sin puntos ni barras-:"]
["c MIEMBRO PH",{"$f":"B34","v":0},{"$f":"C34","v":0},"ESTADO CIVIL:",null,null,"c MIEMBRO PJ",{"$f":"H42","v":0},"TIPO DE PERSONA JCA -UNIÓN TRANSITORIA, asociación, mutual, etc-:"]
["c MIEMBRO PH",{"$f":"IF($E43=\"CASADO/A\",B34,0)","v":0},{"$f":"IF($E43=\"CASADO/A\",C34,0)","v":0},{"$f":"IF(E43=\"CASADO/A\",\"APELLIDO/S CÓNYUGE:\",\"\")","v":""},null,null,"c MIEMBRO PJ",{"$f":"H42","v":0},"ORGANISMO /s DONDE SE INSCRIBIÓ CONSTITUCIÓN (INDICAR LOCALIDAD/PCIA DEL ORG) -si no se inscribió poner: NO INSCRIPTO/A:"]
["c MIEMBRO PH",{"$f":"IF($E43=\"CASADO/A\",B34,0)","v":0},{"$f":"IF($E43=\"CASADO/A\",C34,0)","v":0},{"$f":"IF(E43=\"CASADO/A\",\"NOMBRE/S CÓNYUGE:\",\"\")","v":""},null,null,"c MIEMBRO PJ",{"$f":"IF(I45=\"\",0,H42)","v":0},{"$f":"IF(OR(J44=\"NO INSCRIPTO/A\",J44=\"NO INSCR.\", J44=\"NO INSCR\",J44=\"N/I\", J44= \"NO INSCRIPTO\",J44=\"NO INSCRIPTA\"),\"\",\"DATOS DE RESOLUCIÓN Y FECHA DE INSCRIPCIÓN:\")","v":"DATOS DE RESOLUCIÓN Y FECHA DE INSCRIPCIÓN:"}]
["c MIEMBRO PH",{"$f":"IF($E43=\"CASADO/A\",B34,0)","v":0},{"$f":"IF($E43=\"CASADO/A\",C34,0)","v":0},{"$f":"IF(E43=\"CASADO/A\",\"DOC. IDENTIDAD (cónyuge) –sin puntos ni barras-:\",\"\")","v":""},null,null,"c MIEMBRO PJ",{"$f":"IF(I46=\"\",0,H42)","v":0},{"$f":"IF(I45=\"\",\"\",\"FECHA DE INSCRIPCION:\")","v":"FECHA DE INSCRIPCION:"}]
["g CONTRIB.",{"$f":"B34","v":0},{"$f":"B34","v":0},"CONTRIBUCIÓN -EN PESOS U OTRA MONEDA-:",null,null,"c MIEMBRO PJ",{"$f":"H42","v":0},"APELLIDO/S, NOMBRE/S,  DNI Y CARGO DE CADA MIEMBRO DE SU ADMINISTRACIÓN:"]
["f PARTICIPACION",{"$f":"+B34","v":0},{"$f":"+C34","v":0},"PARTICIPACIÓN S/FONDO COMÚN OPERATIVO (%):",{"$f":"E47/'DATOS UT'!$E$32","v":{"$error":"#DIV/0!"}},null,"c MIEMBRO PJ",{"$f":"IF(AND(J49>0,J48=0),0,H42)","v":0},"DOMICILIO SOCIAL:"]
["i ORG. REP. LEGAL/ ADM.",{"$f":"IF(E49=0,0,B34)","v":0},{"$f":"IF(E49=0,0,C34)","v":0},"NOMBRE CARGO REP. LEGAL/ ADMINISTRACIÓN QUE OCUPA:",null,null,"c MIEMBRO PJ",{"$f":"IF(AND(J48>0,J49=0),0,H42)","v":0},"SEDE SOCIAL:"]
["j ORG. FISCALIZ.",{"$f":"IF(E50=0,0,B35)","v":0},{"$f":"IF(E50=0,0,C35)","v":0},"NOMBRE CARGO FISCALIZACIÓN QUE OCUPA:",null,null,"c MIEMBRO PJ",{"$f":"H42","v":0},"CEL/TEL :"]
["c MIEMBRO PH",{"$f":"IF(E51=0,0,B34)","v":0},{"$f":"IF(E51=0,0,C34)","v":0},"NOTA/OBSERVACIÓN -en mayúscula-:",null,null,"c MIEMBRO PJ",{"$f":"H42","v":0},"OBJETO PRINCIPAL (EN FORMA RESUMIDA):"]
["c MIEMBRO PH",null,0,"DOC. IDENTIDAD –sin puntos-:",null,null,"d CONTRIB.",{"$f":"+H42","v":0},"CONTRIBUCIÓN -EN PESOS U OTRA MONEDA-:"]
["c MIEMBRO PH",{"$f":"+B52","v":0},{"$f":"+C52","v":0},"CUIT/CUIL –sin puntos ni barras-:",null,null,"d CONTRIB.",{"$f":"H42","v":0},"PARTICIPACIÓN S/FONDO COMÚN OPERATIVO (%):",{"$f":"J52/'DATOS UT'!$E$32","v":{"$error":"#DIV/0!"}}]
["c MIEMBRO PH",{"$f":"+B53","v":0},0,"FECHA DE NACIMIENTO –dd/mm/aa-:",null,null,"c MIEMBRO PJ",{"$f":"IF(J54=0,0,H42)","v":0},"NOTA/OBSERVACIÓN -en mayúscula-:"]
["c MIEMBRO PH",{"$f":"+B54","v":0},0,"LUGAR DE NACIMIENTO:",null,null,"c MIEMBRO PJ",null,"CUIT –sin puntos ni barras-:"]
["c MIEMBRO PH",{"$f":"+B55","v":0},0,"NACIONALIDAD:",null,null,"c MIEMBRO PJ",{"$f":"H55","v":0},"TIPO DE PERSONA JCA -UNIÓN TRANSITORIA, asociación, mutual, etc-:"]
["c MIEMBRO PH",{"$f":"+B56","v":0},0,"PROFESIÓN/OFICIO:",null,null,"c MIEMBRO PJ",{"$f":"H55","v":0},"ORGANISMO /s DONDE SE INSCRIBIÓ CONSTITUCIÓN (INDICAR LOCALIDAD/PCIA DEL ORG) -si no se inscribió poner: NO INSCRIPTO/A:"]
["c MIEMBRO PH",{"$f":"+B57","v":0},0,"DOMICILIO REAL:",null,null,"c MIEMBRO PJ",{"$f":"IF(I58=\"\",0,H55)","v":0},{"$f":"IF(OR(J57=\"NO INSCRIPTO/A\",J57=\"NO INSCR.\", J57=\"NO INSCR\",J57=\"N/I\", J57= \"NO INSCRIPTO\",J57=\"NO INSCRIPTA\"),\"\",\"DATOS DE RESOLUCIÓN Y FECHA DE INSCRIPCIÓN:\")","v":"DATOS DE RESOLUCIÓN Y FECHA DE INSCRIPCIÓN:"}]
["c MIEMBRO PH",{"$f":"+B58","v":0},0,"CEL/TEL :",null,null,"c MIEMBRO PJ",{"$f":"IF(I59=\"\",0,H55)","v":0},{"$f":"IF(I58=\"\",\"\",\"FECHA DE INSCRIPCION:\")","v":"FECHA DE INSCRIPCION:"}]
["c MIEMBRO PH",{"$f":"IF(E60=0,0,B52)","v":0},{"$f":"IF(E60=0,0,C52)","v":0},"EMAIL:",null,null,"c MIEMBRO PJ",{"$f":"H55","v":0},"APELLIDO/S, NOMBRE/S,  DNI Y CARGO DE CADA MIEMBRO DE SU ADMINISTRACIÓN:"]
["c MIEMBRO PH",{"$f":"B52","v":0},{"$f":"C52","v":0},"ESTADO CIVIL:",null,null,"c MIEMBRO PJ",{"$f":"IF(AND(J62>0,J61=0),0,H55)","v":0},"DOMICILIO SOCIAL:"]
["c MIEMBRO PH",{"$f":"IF($E61=\"CASADO/A\",B52,0)","v":0},{"$f":"IF($E61=\"CASADO/A\",C52,0)","v":0},{"$f":"IF(E61=\"CASADO/A\",\"APELLIDO/S CÓNYUGE:\",\"\")","v":""},null,null,"c MIEMBRO PJ",{"$f":"IF(AND(J61>0,J62=0),0,H55)","v":0},"SEDE SOCIAL:"]
["c MIEMBRO PH",{"$f":"IF($E61=\"CASADO/A\",B52,0)","v":0},{"$f":"IF($E61=\"CASADO/A\",C52,0)","v":0},{"$f":"IF(E61=\"CASADO/A\",\"NOMBRE/S CÓNYUGE:\",\"\")","v":""},null,null,"c MIEMBRO PJ",{"$f":"H55","v":0},"CEL/TEL :"]
["c MIEMBRO PH",{"$f":"IF($E61=\"CASADO/A\",B52,0)","v":0},{"$f":"IF($E61=\"CASADO/A\",C52,0)","v":0},{"$f":"IF(E61=\"CASADO/A\",\"DOC. IDENTIDAD (cónyuge) –sin puntos ni barras-:\",\"\")","v":""},null,null,"c MIEMBRO PJ",{"$f":"H55","v":0},"OBJETO PRINCIPAL (EN FORMA RESUMIDA):"]
["g CONTRIB.",{"$f":"B52","v":0},{"$f":"B52","v":0},"CONTRIBUCIÓN -EN PESOS U OTRA MONEDA-:",null,null,"d CONTRIB.",{"$f":"+H55","v":0},"CONTRIBUCIÓN -EN PESOS U OTRA MONEDA-:"]
["f PARTICIPACION",{"$f":"+B52","v":0},{"$f":"+C52","v":0},"PARTICIPACIÓN S/FONDO COMÚN OPERATIVO (%):",{"$f":"E65/'DATOS UT'!$E$32","v":{"$error":"#DIV/0!"}},null,"d CONTRIB.",{"$f":"H55","v":0},"PARTICIPACIÓN S/FONDO COMÚN OPERATIVO (%):",{"$f":"J65/'DATOS UT'!$E$32","v":{"$error":"#DIV/0!"}}]
["i ORG. REP. LEGAL/ ADM.",{"$f":"IF(E67=0,0,B52)","v":0},{"$f":"IF(E67=0,0,C52)","v":0},"NOMBRE CARGO REP. LEGAL/ ADMINISTRACIÓN QUE OCUPA:",null,null,"c MIEMBRO PJ",{"$f":"IF(J67=0,0,H55)","v":0},"NOTA/OBSERVACIÓN -en mayúscula-:"]
["j ORG. FISCALIZ.",{"$f":"IF(E68=0,0,B53)","v":0},{"$f":"IF(E68=0,0,C53)","v":0},"NOMBRE CARGO FISCALIZACIÓN QUE OCUPA:",null,null,"c MIEMBRO PJ",null,"CUIT –sin puntos ni barras-:"]
["c MIEMBRO PH",{"$f":"IF(E69=0,0,B52)","v":0},{"$f":"IF(E69=0,0,C52)","v":0},"NOTA/OBSERVACIÓN -en mayúscula-:",null,null,"c MIEMBRO PJ",{"$f":"H68","v":0},"TIPO DE PERSONA JCA -UNIÓN TRANSITORIA, asociación, mutual, etc-:"]
["c MIEMBRO PH",null,0,"DOC. IDENTIDAD –sin puntos-:",null,null,"c MIEMBRO PJ",{"$f":"H68","v":0},"ORGANISMO /s DONDE SE INSCRIBIÓ CONSTITUCIÓN (INDICAR LOCALIDAD/PCIA DEL ORG) -si no se inscribió poner: NO INSCRIPTO/A:"]
["c MIEMBRO PH",{"$f":"+B70","v":0},{"$f":"+C70","v":0},"CUIT/CUIL –sin puntos ni barras-:",null,null,"c MIEMBRO PJ",{"$f":"IF(I71=\"\",0,H68)","v":0},{"$f":"IF(OR(J70=\"NO INSCRIPTO/A\",J70=\"NO INSCR.\", J70=\"NO INSCR\",J70=\"N/I\", J70= \"NO INSCRIPTO\",J70=\"NO INSCRIPTA\"),\"\",\"DATOS DE RESOLUCIÓN Y FECHA DE INSCRIPCIÓN:\")","v":"DATOS DE RESOLUCIÓN Y FECHA DE INSCRIPCIÓN:"}]
["c MIEMBRO PH",{"$f":"+B71","v":0},0,"FECHA DE NACIMIENTO –dd/mm/aa-:",null,null,"c MIEMBRO PJ",{"$f":"IF(I72=\"\",0,H68)","v":0},{"$f":"IF(I71=\"\",\"\",\"FECHA DE INSCRIPCION:\")","v":"FECHA DE INSCRIPCION:"}]
["c MIEMBRO PH",{"$f":"+B72","v":0},0,"LUGAR DE NACIMIENTO:",null,null,"c MIEMBRO PJ",{"$f":"H68","v":0},"APELLIDO/S, NOMBRE/S,  DNI Y CARGO DE CADA MIEMBRO DE SU ADMINISTRACIÓN:"]
["c MIEMBRO PH",{"$f":"+B73","v":0},0,"NACIONALIDAD:",null,null,"c MIEMBRO PJ",{"$f":"IF(AND(J75>0,J74=0),0,H68)","v":0},"DOMICILIO SOCIAL:"]
["c MIEMBRO PH",{"$f":"+B74","v":0},0,"PROFESIÓN/OFICIO:",null,null,"c MIEMBRO PJ",{"$f":"IF(AND(J74>0,J75=0),0,H68)","v":0},"SEDE SOCIAL:"]
["c MIEMBRO PH",{"$f":"+B75","v":0},0,"DOMICILIO REAL:",null,null,"c MIEMBRO PJ",{"$f":"H68","v":0},"CEL/TEL :"]
["c MIEMBRO PH",{"$f":"+B76","v":0},0,"CEL/TEL :",null,null,"c MIEMBRO PJ",{"$f":"H68","v":0},"OBJETO PRINCIPAL (EN FORMA RESUMIDA):"]
["c MIEMBRO PH",{"$f":"IF(E78=0,0,B70)","v":0},{"$f":"IF(E78=0,0,C70)","v":0},"EMAIL:",null,null,"d CONTRIB.",{"$f":"+H68","v":0},"CONTRIBUCIÓN -EN PESOS U OTRA MONEDA-:"]
["c MIEMBRO PH",{"$f":"B70","v":0},{"$f":"C70","v":0},"ESTADO CIVIL:",null,null,"d CONTRIB.",{"$f":"H68","v":0},"PARTICIPACIÓN S/FONDO COMÚN OPERATIVO (%):",{"$f":"J78/'DATOS UT'!$E$32","v":{"$error":"#DIV/0!"}}]
["c MIEMBRO PH",{"$f":"IF($E79=\"CASADO/A\",B70,0)","v":0},{"$f":"IF($E79=\"CASADO/A\",C70,0)","v":0},{"$f":"IF(E79=\"CASADO/A\",\"APELLIDO/S CÓNYUGE:\",\"\")","v":""},null,null,"c MIEMBRO PJ",{"$f":"IF(J80=0,0,H68)","v":0},"NOTA/OBSERVACIÓN -en mayúscula-:"]
["c MIEMBRO PH",{"$f":"IF($E79=\"CASADO/A\",B70,0)","v":0},{"$f":"IF($E79=\"CASADO/A\",C70,0)","v":0},{"$f":"IF(E79=\"CASADO/A\",\"NOMBRE/S CÓNYUGE:\",\"\")","v":""},null,null,"c MIEMBRO PJ",null,"CUIT –sin puntos ni barras-:"]
["c MIEMBRO PH",{"$f":"IF($E79=\"CASADO/A\",B70,0)","v":0},{"$f":"IF($E79=\"CASADO/A\",C70,0)","v":0},{"$f":"IF(E79=\"CASADO/A\",\"DOC. IDENTIDAD (cónyuge) –sin puntos ni barras-:\",\"\")","v":""},null,null,"c MIEMBRO PJ",{"$f":"H81","v":0},"TIPO DE PERSONA JCA -UNIÓN TRANSITORIA, asociación, mutual, etc-:"]
["g CONTRIB.",{"$f":"B70","v":0},{"$f":"B70","v":0},"CONTRIBUCIÓN -EN PESOS U OTRA MONEDA-:",null,null,"c MIEMBRO PJ",{"$f":"H81","v":0},"ORGANISMO /s DONDE SE INSCRIBIÓ CONSTITUCIÓN (INDICAR LOCALIDAD/PCIA DEL ORG) -si no se inscribió poner: NO INSCRIPTO/A:"]
["f PARTICIPACION",{"$f":"+B70","v":0},{"$f":"+C70","v":0},"PARTICIPACIÓN S/FONDO COMÚN OPERATIVO (%):",{"$f":"E83/'DATOS UT'!$E$32","v":{"$error":"#DIV/0!"}},null,"c MIEMBRO PJ",{"$f":"IF(I84=\"\",0,H81)","v":0},{"$f":"IF(OR(J83=\"NO INSCRIPTO/A\",J83=\"NO INSCR.\", J83=\"NO INSCR\",J83=\"N/I\", J83= \"NO INSCRIPTO\",J83=\"NO INSCRIPTA\"),\"\",\"DATOS DE RESOLUCIÓN Y FECHA DE INSCRIPCIÓN:\")","v":"DATOS DE RESOLUCIÓN Y FECHA DE INSCRIPCIÓN:"}]
["i ORG. REP. LEGAL/ ADM.",{"$f":"IF(E85=0,0,B70)","v":0},{"$f":"IF(E85=0,0,C70)","v":0},"NOMBRE CARGO REP. LEGAL/ ADMINISTRACIÓN QUE OCUPA:",null,null,"c MIEMBRO PJ",{"$f":"IF(I85=\"\",0,H81)","v":0},{"$f":"IF(I84=\"\",\"\",\"FECHA DE INSCRIPCION:\")","v":"FECHA DE INSCRIPCION:"}]
["j ORG. FISCALIZ.",{"$f":"IF(E86=0,0,B71)","v":0},{"$f":"IF(E86=0,0,C71)","v":0},"NOMBRE CARGO FISCALIZACIÓN QUE OCUPA:",null,null,"c MIEMBRO PJ",{"$f":"H81","v":0},"APELLIDO/S, NOMBRE/S,  DNI Y CARGO DE CADA MIEMBRO DE SU ADMINISTRACIÓN:"]
["c MIEMBRO PH",{"$f":"IF(E87=0,0,B70)","v":0},{"$f":"IF(E87=0,0,C70)","v":0},"NOTA/OBSERVACIÓN -en mayúscula-:",null,null,"c MIEMBRO PJ",{"$f":"IF(AND(J88>0,J87=0),0,H81)","v":0},"DOMICILIO SOCIAL:"]
["c MIEMBRO PH",null,0,"DOC. IDENTIDAD –sin puntos-:",null,null,"c MIEMBRO PJ",{"$f":"IF(AND(J87>0,J88=0),0,H81)","v":0},"SEDE SOCIAL:"]
["c MIEMBRO PH",{"$f":"+B88","v":0},{"$f":"+C88","v":0},"CUIT/CUIL –sin puntos ni barras-:",null,null,"c MIEMBRO PJ",{"$f":"H81","v":0},"CEL/TEL :"]
["c MIEMBRO PH",{"$f":"+B89","v":0},0,"FECHA DE NACIMIENTO –dd/mm/aa-:",null,null,"c MIEMBRO PJ",{"$f":"H81","v":0},"OBJETO PRINCIPAL (EN FORMA RESUMIDA):"]
["c MIEMBRO PH",{"$f":"+B90","v":0},0,"LUGAR DE NACIMIENTO:",null,null,"d CONTRIB.",{"$f":"+H81","v":0},"CONTRIBUCIÓN -EN PESOS U OTRA MONEDA-:"]
["c MIEMBRO PH",{"$f":"+B91","v":0},0,"NACIONALIDAD:",null,null,"d CONTRIB.",{"$f":"H81","v":0},"PARTICIPACIÓN S/FONDO COMÚN OPERATIVO (%):",{"$f":"J91/'DATOS UT'!$E$32","v":{"$error":"#DIV/0!"}}]
["c MIEMBRO PH",{"$f":"+B92","v":0},0,"PROFESIÓN/OFICIO:",null,null,"c MIEMBRO PJ",{"$f":"IF(J93=0,0,H81)","v":0},"NOTA/OBSERVACIÓN -en mayúscula-:"]
["c MIEMBRO PH",{"$f":"+B93","v":0},0,"DOMICILIO REAL:",null,null,"c MIEMBRO PJ",null,"CUIT –sin puntos ni barras-:"]
["c MIEMBRO PH",{"$f":"+B94","v":0},0,"CEL/TEL :",null,null,"c MIEMBRO PJ",{"$f":"H94","v":0},"TIPO DE PERSONA JCA -UNIÓN TRANSITORIA, asociación, mutual, etc-:"]
["c MIEMBRO PH",{"$f":"IF(E96=0,0,B88)","v":0},{"$f":"IF(E96=0,0,C88)","v":0},"EMAIL:",null,null,"c MIEMBRO PJ",{"$f":"H94","v":0},"ORGANISMO /s DONDE SE INSCRIBIÓ CONSTITUCIÓN (INDICAR LOCALIDAD/PCIA DEL ORG) -si no se inscribió poner: NO INSCRIPTO/A:"]
["c MIEMBRO PH",{"$f":"B88","v":0},{"$f":"C88","v":0},"ESTADO CIVIL:",null,null,"c MIEMBRO PJ",{"$f":"IF(I97=\"\",0,H94)","v":0},{"$f":"IF(OR(J96=\"NO INSCRIPTO/A\",J96=\"NO INSCR.\", J96=\"NO INSCR\",J96=\"N/I\", J96= \"NO INSCRIPTO\",J96=\"NO INSCRIPTA\"),\"\",\"DATOS DE RESOLUCIÓN Y FECHA DE INSCRIPCIÓN:\")","v":"DATOS DE RESOLUCIÓN Y FECHA DE INSCRIPCIÓN:"}]
["c MIEMBRO PH",{"$f":"IF($E97=\"CASADO/A\",B88,0)","v":0},{"$f":"IF($E97=\"CASADO/A\",C88,0)","v":0},{"$f":"IF(E97=\"CASADO/A\",\"APELLIDO/S CÓNYUGE:\",\"\")","v":""},null,null,"c MIEMBRO PJ",{"$f":"IF(I98=\"\",0,H94)","v":0},{"$f":"IF(I97=\"\",\"\",\"FECHA DE INSCRIPCION:\")","v":"FECHA DE INSCRIPCION:"}]
["c MIEMBRO PH",{"$f":"IF($E97=\"CASADO/A\",B88,0)","v":0},{"$f":"IF($E97=\"CASADO/A\",C88,0)","v":0},{"$f":"IF(E97=\"CASADO/A\",\"NOMBRE/S CÓNYUGE:\",\"\")","v":""},null,null,"c MIEMBRO PJ",{"$f":"H94","v":0},"APELLIDO/S, NOMBRE/S,  DNI Y CARGO DE CADA MIEMBRO DE SU ADMINISTRACIÓN:"]
["c MIEMBRO PH",{"$f":"IF($E97=\"CASADO/A\",B88,0)","v":0},{"$f":"IF($E97=\"CASADO/A\",C88,0)","v":0},{"$f":"IF(E97=\"CASADO/A\",\"DOC. IDENTIDAD (cónyuge) –sin puntos ni barras-:\",\"\")","v":""},null,null,"c MIEMBRO PJ",{"$f":"IF(AND(J101>0,J100=0),0,H94)","v":0},"DOMICILIO SOCIAL:"]
["g CONTRIB.",{"$f":"B88","v":0},{"$f":"B88","v":0},"CONTRIBUCIÓN -EN PESOS U OTRA MONEDA-:",null,null,"c MIEMBRO PJ",{"$f":"IF(AND(J100>0,J101=0),0,H94)","v":0},"SEDE SOCIAL:"]
["f PARTICIPACION",{"$f":"+B88","v":0},{"$f":"+C88","v":0},"PARTICIPACIÓN S/FONDO COMÚN OPERATIVO (%):",{"$f":"E101/'DATOS UT'!$E$32","v":{"$error":"#DIV/0!"}},null,"c MIEMBRO PJ",{"$f":"H94","v":0},"CEL/TEL :"]
["i ORG. REP. LEGAL/ ADM.",{"$f":"IF(E103=0,0,B88)","v":0},{"$f":"IF(E103=0,0,C88)","v":0},"NOMBRE CARGO REP. LEGAL/ ADMINISTRACIÓN QUE OCUPA:",null,null,"c MIEMBRO PJ",{"$f":"H94","v":0},"OBJETO PRINCIPAL (EN FORMA RESUMIDA):"]
["j ORG. FISCALIZ.",{"$f":"IF(E104=0,0,B89)","v":0},{"$f":"IF(E104=0,0,C89)","v":0},"NOMBRE CARGO FISCALIZACIÓN QUE OCUPA:",null,null,"d CONTRIB.",{"$f":"+H94","v":0},"CONTRIBUCIÓN -EN PESOS U OTRA MONEDA-:"]
["c MIEMBRO PH",{"$f":"IF(E105=0,0,B88)","v":0},{"$f":"IF(E105=0,0,C88)","v":0},"NOTA/OBSERVACIÓN -en mayúscula-:",null,null,"d CONTRIB.",{"$f":"H94","v":0},"PARTICIPACIÓN S/FONDO COMÚN OPERATIVO (%):",{"$f":"J104/'DATOS UT'!$E$32","v":{"$error":"#DIV/0!"}}]
["c MIEMBRO PH",null,0,"DOC. IDENTIDAD –sin puntos-:",null,null,"c MIEMBRO PJ",{"$f":"IF(J106=0,0,H94)","v":0},"NOTA/OBSERVACIÓN -en mayúscula-:"]
["c MIEMBRO PH",{"$f":"+B106","v":0},{"$f":"+C106","v":0},"CUIT/CUIL –sin puntos ni barras-:",null,null,"c MIEMBRO PJ",null,"CUIT –sin puntos ni barras-:"]
["c MIEMBRO PH",{"$f":"+B107","v":0},0,"FECHA DE NACIMIENTO –dd/mm/aa-:",null,null,"c MIEMBRO PJ",{"$f":"H107","v":0},"TIPO DE PERSONA JCA -UNIÓN TRANSITORIA, asociación, mutual, etc-:"]
["c MIEMBRO PH",{"$f":"+B108","v":0},0,"LUGAR DE NACIMIENTO:",null,null,"c MIEMBRO PJ",{"$f":"H107","v":0},"ORGANISMO /s DONDE SE INSCRIBIÓ CONSTITUCIÓN (INDICAR LOCALIDAD/PCIA DEL ORG) -si no se inscribió poner: NO INSCRIPTO/A:"]
["c MIEMBRO PH",{"$f":"+B109","v":0},0,"NACIONALIDAD:",null,null,"c MIEMBRO PJ",{"$f":"IF(I110=\"\",0,H107)","v":0},{"$f":"IF(OR(J109=\"NO INSCRIPTO/A\",J109=\"NO INSCR.\", J109=\"NO INSCR\",J109=\"N/I\", J109= \"NO INSCRIPTO\",J109=\"NO INSCRIPTA\"),\"\",\"DATOS DE RESOLUCIÓN Y FECHA DE INSCRIPCIÓN:\")","v":"DATOS DE RESOLUCIÓN Y FECHA DE INSCRIPCIÓN:"}]
["c MIEMBRO PH",{"$f":"+B110","v":0},0,"PROFESIÓN/OFICIO:",null,null,"c MIEMBRO PJ",{"$f":"IF(I111=\"\",0,H107)","v":0},{"$f":"IF(I110=\"\",\"\",\"FECHA DE INSCRIPCION:\")","v":"FECHA DE INSCRIPCION:"}]
["c MIEMBRO PH",{"$f":"+B111","v":0},0,"DOMICILIO REAL:",null,null,"c MIEMBRO PJ",{"$f":"H107","v":0},"APELLIDO/S, NOMBRE/S,  DNI Y CARGO DE CADA MIEMBRO DE SU ADMINISTRACIÓN:"]
["c MIEMBRO PH",{"$f":"+B112","v":0},0,"CEL/TEL :",null,null,"c MIEMBRO PJ",{"$f":"IF(AND(J114>0,J113=0),0,H107)","v":0},"DOMICILIO SOCIAL:"]
["c MIEMBRO PH",{"$f":"IF(E114=0,0,B106)","v":0},{"$f":"IF(E114=0,0,C106)","v":0},"EMAIL:",null,null,"c MIEMBRO PJ",{"$f":"IF(AND(J113>0,J114=0),0,H107)","v":0},"SEDE SOCIAL:"]
["c MIEMBRO PH",{"$f":"B106","v":0},{"$f":"C106","v":0},"ESTADO CIVIL:",null,null,"c MIEMBRO PJ",{"$f":"H107","v":0},"CEL/TEL :"]
["c MIEMBRO PH",{"$f":"IF($E115=\"CASADO/A\",B106,0)","v":0},{"$f":"IF($E115=\"CASADO/A\",C106,0)","v":0},{"$f":"IF(E115=\"CASADO/A\",\"APELLIDO/S CÓNYUGE:\",\"\")","v":""},null,null,"c MIEMBRO PJ",{"$f":"H107","v":0},"OBJETO PRINCIPAL (EN FORMA RESUMIDA):"]
["c MIEMBRO PH",{"$f":"IF($E115=\"CASADO/A\",B106,0)","v":0},{"$f":"IF($E115=\"CASADO/A\",C106,0)","v":0},{"$f":"IF(E115=\"CASADO/A\",\"NOMBRE/S CÓNYUGE:\",\"\")","v":""},null,null,"d CONTRIB.",{"$f":"+H107","v":0},"CONTRIBUCIÓN -EN PESOS U OTRA MONEDA-:"]
["c MIEMBRO PH",{"$f":"IF($E115=\"CASADO/A\",B106,0)","v":0},{"$f":"IF($E115=\"CASADO/A\",C106,0)","v":0},{"$f":"IF(E115=\"CASADO/A\",\"DOC. IDENTIDAD (cónyuge) –sin puntos ni barras-:\",\"\")","v":""},null,null,"d CONTRIB.",{"$f":"H107","v":0},"PARTICIPACIÓN S/FONDO COMÚN OPERATIVO (%):",{"$f":"J117/'DATOS UT'!$E$32","v":{"$error":"#DIV/0!"}}]
["g CONTRIB.",{"$f":"B106","v":0},{"$f":"B106","v":0},"CONTRIBUCIÓN -EN PESOS U OTRA MONEDA-:",null,null,"c MIEMBRO PJ",{"$f":"IF(J119=0,0,H107)","v":0},"NOTA/OBSERVACIÓN -en mayúscula-:"]
["f PARTICIPACION",{"$f":"+B106","v":0},{"$f":"+C106","v":0},"PARTICIPACIÓN S/FONDO COMÚN OPERATIVO (%):",{"$f":"E119/'DATOS UT'!$E$32","v":{"$error":"#DIV/0!"}},null,"c MIEMBRO PJ",null,"CUIT –sin puntos ni barras-:"]
["i ORG. REP. LEGAL/ ADM.",{"$f":"IF(E121=0,0,B106)","v":0},{"$f":"IF(E121=0,0,C106)","v":0},"NOMBRE CARGO REP. LEGAL/ ADMINISTRACIÓN QUE OCUPA:",null,null,"c MIEMBRO PJ",{"$f":"H120","v":0},"TIPO DE PERSONA JCA -UNIÓN TRANSITORIA, asociación, mutual, etc-:"]
["j ORG. FISCALIZ.",{"$f":"IF(E122=0,0,B107)","v":0},{"$f":"IF(E122=0,0,C107)","v":0},"NOMBRE CARGO FISCALIZACIÓN QUE OCUPA:",null,null,"c MIEMBRO PJ",{"$f":"H120","v":0},"ORGANISMO /s DONDE SE INSCRIBIÓ CONSTITUCIÓN (INDICAR LOCALIDAD/PCIA DEL ORG) -si no se inscribió poner: NO INSCRIPTO/A:"]
["c MIEMBRO PH",{"$f":"IF(E123=0,0,B106)","v":0},{"$f":"IF(E123=0,0,C106)","v":0},"NOTA/OBSERVACIÓN -en mayúscula-:",null,null,"c MIEMBRO PJ",{"$f":"IF(I123=\"\",0,H120)","v":0},{"$f":"IF(OR(J122=\"NO INSCRIPTO/A\",J122=\"NO INSCR.\", J122=\"NO INSCR\",J122=\"N/I\", J122= \"NO INSCRIPTO\",J122=\"NO INSCRIPTA\"),\"\",\"DATOS DE RESOLUCIÓN Y FECHA DE INSCRIPCIÓN:\")","v":"DATOS DE RESOLUCIÓN Y FECHA DE INSCRIPCIÓN:"}]
["c MIEMBRO PH",null,0,"DOC. IDENTIDAD –sin puntos-:",null,null,"c MIEMBRO PJ",{"$f":"IF(I124=\"\",0,H120)","v":0},{"$f":"IF(I123=\"\",\"\",\"FECHA DE INSCRIPCION:\")","v":"FECHA DE INSCRIPCION:"}]
["c MIEMBRO PH",{"$f":"+B124","v":0},{"$f":"+C124","v":0},"CUIT/CUIL –sin puntos ni barras-:",null,null,"c MIEMBRO PJ",{"$f":"H120","v":0},"APELLIDO/S, NOMBRE/S,  DNI Y CARGO DE CADA MIEMBRO DE SU ADMINISTRACIÓN:"]
["c MIEMBRO PH",{"$f":"+B125","v":0},0,"FECHA DE NACIMIENTO –dd/mm/aa-:",null,null,"c MIEMBRO PJ",{"$f":"IF(AND(J127>0,J126=0),0,H120)","v":0},"DOMICILIO SOCIAL:"]
["c MIEMBRO PH",{"$f":"+B126","v":0},0,"LUGAR DE NACIMIENTO:",null,null,"c MIEMBRO PJ",{"$f":"IF(AND(J126>0,J127=0),0,H120)","v":0},"SEDE SOCIAL:"]
["c MIEMBRO PH",{"$f":"+B127","v":0},0,"NACIONALIDAD:",null,null,"c MIEMBRO PJ",{"$f":"H120","v":0},"CEL/TEL :"]
["c MIEMBRO PH",{"$f":"+B128","v":0},0,"PROFESIÓN/OFICIO:",null,null,"c MIEMBRO PJ",{"$f":"H120","v":0},"OBJETO PRINCIPAL (EN FORMA RESUMIDA):"]
["c MIEMBRO PH",{"$f":"+B129","v":0},0,"DOMICILIO REAL:",null,null,"d CONTRIB.",{"$f":"+H120","v":0},"CONTRIBUCIÓN -EN PESOS U OTRA MONEDA-:"]
["c MIEMBRO PH",{"$f":"+B130","v":0},0,"CEL/TEL :",null,null,"d CONTRIB.",{"$f":"H120","v":0},"PARTICIPACIÓN S/FONDO COMÚN OPERATIVO (%):",{"$f":"J130/'DATOS UT'!$E$32","v":{"$error":"#DIV/0!"}}]
["c MIEMBRO PH",{"$f":"IF(E132=0,0,B124)","v":0},{"$f":"IF(E132=0,0,C124)","v":0},"EMAIL:",null,null,"c MIEMBRO PJ",{"$f":"IF(J132=0,0,H120)","v":0},"NOTA/OBSERVACIÓN -en mayúscula-:"]
["c MIEMBRO PH",{"$f":"B124","v":0},{"$f":"C124","v":0},"ESTADO CIVIL:",null,null,"c MIEMBRO PJ",null,"CUIT –sin puntos ni barras-:"]
["c MIEMBRO PH",{"$f":"IF($E133=\"CASADO/A\",B124,0)","v":0},{"$f":"IF($E133=\"CASADO/A\",C124,0)","v":0},{"$f":"IF(E133=\"CASADO/A\",\"APELLIDO/S CÓNYUGE:\",\"\")","v":""},null,null,"c MIEMBRO PJ",{"$f":"H133","v":0},"TIPO DE PERSONA JCA -UNIÓN TRANSITORIA, asociación, mutual, etc-:"]
["c MIEMBRO PH",{"$f":"IF($E133=\"CASADO/A\",B124,0)","v":0},{"$f":"IF($E133=\"CASADO/A\",C124,0)","v":0},{"$f":"IF(E133=\"CASADO/A\",\"NOMBRE/S CÓNYUGE:\",\"\")","v":""},null,null,"c MIEMBRO PJ",{"$f":"H133","v":0},"ORGANISMO /s DONDE SE INSCRIBIÓ CONSTITUCIÓN (INDICAR LOCALIDAD/PCIA DEL ORG) -si no se inscribió poner: NO INSCRIPTO/A:"]
["c MIEMBRO PH",{"$f":"IF($E133=\"CASADO/A\",B124,0)","v":0},{"$f":"IF($E133=\"CASADO/A\",C124,0)","v":0},{"$f":"IF(E133=\"CASADO/A\",\"DOC. IDENTIDAD (cónyuge) –sin puntos ni barras-:\",\"\")","v":""},null,null,"c MIEMBRO PJ",{"$f":"IF(I136=\"\",0,H133)","v":0},{"$f":"IF(OR(J135=\"NO INSCRIPTO/A\",J135=\"NO INSCR.\", J135=\"NO INSCR\",J135=\"N/I\", J135= \"NO INSCRIPTO\",J135=\"NO INSCRIPTA\"),\"\",\"DATOS DE RESOLUCIÓN Y FECHA DE INSCRIPCIÓN:\")","v":"DATOS DE RESOLUCIÓN Y FECHA DE INSCRIPCIÓN:"}]
["g CONTRIB.",{"$f":"B124","v":0},{"$f":"B124","v":0},"CONTRIBUCIÓN -EN PESOS U OTRA MONEDA-:",null,null,"c MIEMBRO PJ",{"$f":"IF(I137=\"\",0,H133)","v":0},{"$f":"IF(I136=\"\",\"\",\"FECHA DE INSCRIPCION:\")","v":"FECHA DE INSCRIPCION:"}]
["f PARTICIPACION",{"$f":"+B124","v":0},{"$f":"+C124","v":0},"PARTICIPACIÓN S/FONDO COMÚN OPERATIVO (%):",{"$f":"E137/'DATOS UT'!$E$32","v":{"$error":"#DIV/0!"}},null,"c MIEMBRO PJ",{"$f":"H133","v":0},"APELLIDO/S, NOMBRE/S,  DNI Y CARGO DE CADA MIEMBRO DE SU ADMINISTRACIÓN:"]
["i ORG. REP. LEGAL/ ADM.",{"$f":"IF(E139=0,0,B124)","v":0},{"$f":"IF(E139=0,0,C124)","v":0},"NOMBRE CARGO REP. LEGAL/ ADMINISTRACIÓN QUE OCUPA:",null,null,"c MIEMBRO PJ",{"$f":"IF(AND(J140>0,J139=0),0,H133)","v":0},"DOMICILIO SOCIAL:"]
["j ORG. FISCALIZ.",{"$f":"IF(E140=0,0,B125)","v":0},{"$f":"IF(E140=0,0,C125)","v":0},"NOMBRE CARGO FISCALIZACIÓN QUE OCUPA:",null,null,"c MIEMBRO PJ",{"$f":"IF(AND(J139>0,J140=0),0,H133)","v":0},"SEDE SOCIAL:"]
["c MIEMBRO PH",{"$f":"IF(E141=0,0,B124)","v":0},{"$f":"IF(E141=0,0,C124)","v":0},"NOTA/OBSERVACIÓN -en mayúscula-:",null,null,"c MIEMBRO PJ",{"$f":"H133","v":0},"CEL/TEL :"]
["c MIEMBRO PH",null,0,"DOC. IDENTIDAD –sin puntos-:",null,null,"c MIEMBRO PJ",{"$f":"H133","v":0},"OBJETO PRINCIPAL (EN FORMA RESUMIDA):"]
["c MIEMBRO PH",{"$f":"+B142","v":0},{"$f":"+C142","v":0},"CUIT/CUIL –sin puntos ni barras-:",null,null,"d CONTRIB.",{"$f":"+H133","v":0},"CONTRIBUCIÓN -EN PESOS U OTRA MONEDA-:"]
["c MIEMBRO PH",{"$f":"+B143","v":0},0,"FECHA DE NACIMIENTO –dd/mm/aa-:",null,null,"d CONTRIB.",{"$f":"H133","v":0},"PARTICIPACIÓN S/FONDO COMÚN OPERATIVO (%):",{"$f":"J143/'DATOS UT'!$E$32","v":{"$error":"#DIV/0!"}}]
["c MIEMBRO PH",{"$f":"+B144","v":0},0,"LUGAR DE NACIMIENTO:",null,null,"c MIEMBRO PJ",{"$f":"IF(J145=0,0,H133)","v":0},"NOTA/OBSERVACIÓN -en mayúscula-:"]
["c MIEMBRO PH",{"$f":"+B145","v":0},0,"NACIONALIDAD:"]
["c MIEMBRO PH",{"$f":"+B146","v":0},0,"PROFESIÓN/OFICIO:"]
["c MIEMBRO PH",{"$f":"+B147","v":0},0,"DOMICILIO REAL:"]
["c MIEMBRO PH",{"$f":"+B148","v":0},0,"CEL/TEL :"]
["c MIEMBRO PH",{"$f":"IF(E150=0,0,B142)","v":0},{"$f":"IF(E150=0,0,C142)","v":0},"EMAIL:"]
["c MIEMBRO PH",{"$f":"B142","v":0},{"$f":"C142","v":0},"ESTADO CIVIL:"]
["c MIEMBRO PH",{"$f":"IF($E151=\"CASADO/A\",B142,0)","v":0},{"$f":"IF($E151=\"CASADO/A\",C142,0)","v":0},{"$f":"IF(E151=\"CASADO/A\",\"APELLIDO/S CÓNYUGE:\",\"\")","v":""}]
["c MIEMBRO PH",{"$f":"IF($E151=\"CASADO/A\",B142,0)","v":0},{"$f":"IF($E151=\"CASADO/A\",C142,0)","v":0},{"$f":"IF(E151=\"CASADO/A\",\"NOMBRE/S CÓNYUGE:\",\"\")","v":""}]
["c MIEMBRO PH",{"$f":"IF($E151=\"CASADO/A\",B142,0)","v":0},{"$f":"IF($E151=\"CASADO/A\",C142,0)","v":0},{"$f":"IF(E151=\"CASADO/A\",\"DOC. IDENTIDAD (cónyuge) –sin puntos ni barras-:\",\"\")","v":""}]
["g CONTRIB.",{"$f":"B142","v":0},{"$f":"B142","v":0},"CONTRIBUCIÓN -EN PESOS U OTRA MONEDA-:"]
["f PARTICIPACION",{"$f":"+B142","v":0},{"$f":"+C142","v":0},"PARTICIPACIÓN S/FONDO COMÚN OPERATIVO (%):",{"$f":"E155/'DATOS UT'!$E$32","v":{"$error":"#DIV/0!"}}]
["i ORG. REP. LEGAL/ ADM.",{"$f":"IF(E157=0,0,B142)","v":0},{"$f":"IF(E157=0,0,C142)","v":0},"NOMBRE CARGO REP. LEGAL/ ADMINISTRACIÓN QUE OCUPA:"]
["j ORG. FISCALIZ.",{"$f":"IF(E158=0,0,B143)","v":0},{"$f":"IF(E158=0,0,C143)","v":0},"NOMBRE CARGO FISCALIZACIÓN QUE OCUPA:"]
["c MIEMBRO PH",{"$f":"IF(E159=0,0,B142)","v":0},{"$f":"IF(E159=0,0,C142)","v":0},"NOTA/OBSERVACIÓN -en mayúscula-:"]
["c MIEMBRO PH",null,0,"DOC. IDENTIDAD –sin puntos-:"]
["c MIEMBRO PH",{"$f":"+B160","v":0},{"$f":"+C160","v":0},"CUIT/CUIL –sin puntos ni barras-:"]
["c MIEMBRO PH",{"$f":"+B161","v":0},0,"FECHA DE NACIMIENTO –dd/mm/aa-:"]
["c MIEMBRO PH",{"$f":"+B162","v":0},0,"LUGAR DE NACIMIENTO:"]
["c MIEMBRO PH",{"$f":"+B163","v":0},0,"NACIONALIDAD:"]
["c MIEMBRO PH",{"$f":"+B164","v":0},0,"PROFESIÓN/OFICIO:"]
["c MIEMBRO PH",{"$f":"+B165","v":0},0,"DOMICILIO REAL:"]
["c MIEMBRO PH",{"$f":"+B166","v":0},0,"CEL/TEL :"]
["c MIEMBRO PH",{"$f":"IF(E168=0,0,B160)","v":0},{"$f":"IF(E168=0,0,C160)","v":0},"EMAIL:"]
["c MIEMBRO PH",{"$f":"B160","v":0},{"$f":"C160","v":0},"ESTADO CIVIL:"]
["c MIEMBRO PH",{"$f":"IF($E169=\"CASADO/A\",B160,0)","v":0},{"$f":"IF($E169=\"CASADO/A\",C160,0)","v":0},{"$f":"IF(E169=\"CASADO/A\",\"APELLIDO/S CÓNYUGE:\",\"\")","v":""}]
["c MIEMBRO PH",{"$f":"IF($E169=\"CASADO/A\",B160,0)","v":0},{"$f":"IF($E169=\"CASADO/A\",C160,0)","v":0},{"$f":"IF(E169=\"CASADO/A\",\"NOMBRE/S CÓNYUGE:\",\"\")","v":""}]
["c MIEMBRO PH",{"$f":"IF($E169=\"CASADO/A\",B160,0)","v":0},{"$f":"IF($E169=\"CASADO/A\",C160,0)","v":0},{"$f":"IF(E169=\"CASADO/A\",\"DOC. IDENTIDAD (cónyuge) –sin puntos ni barras-:\",\"\")","v":""}]
["g CONTRIB.",{"$f":"B160","v":0},{"$f":"B160","v":0},"CONTRIBUCIÓN -EN PESOS U OTRA MONEDA-:"]
["f PARTICIPACION",{"$f":"+B160","v":0},{"$f":"+C160","v":0},"PARTICIPACIÓN S/FONDO COMÚN OPERATIVO (%):",{"$f":"E173/'DATOS UT'!$E$32","v":{"$error":"#DIV/0!"}}]
["i ORG. REP. LEGAL/ ADM.",{"$f":"IF(E175=0,0,B160)","v":0},{"$f":"IF(E175=0,0,C160)","v":0},"NOMBRE CARGO REP. LEGAL/ ADMINISTRACIÓN QUE OCUPA:"]
["j ORG. FISCALIZ.",{"$f":"IF(E176=0,0,B161)","v":0},{"$f":"IF(E176=0,0,C161)","v":0},"NOMBRE CARGO FISCALIZACIÓN QUE OCUPA:"]
["c MIEMBRO PH",{"$f":"IF(E177=0,0,B160)","v":0},{"$f":"IF(E177=0,0,C160)","v":0},"NOTA/OBSERVACIÓN -en mayúscula-:"]
["c MIEMBRO PH",null,0,"DOC. IDENTIDAD –sin puntos-:"]
["c MIEMBRO PH",{"$f":"+B178","v":0},{"$f":"+C178","v":0},"CUIT/CUIL –sin puntos ni barras-:"]
["c MIEMBRO PH",{"$f":"+B179","v":0},0,"FECHA DE NACIMIENTO –dd/mm/aa-:"]
["c MIEMBRO PH",{"$f":"+B180","v":0},0,"LUGAR DE NACIMIENTO:"]
["c MIEMBRO PH",{"$f":"+B181","v":0},0,"NACIONALIDAD:"]
["c MIEMBRO PH",{"$f":"+B182","v":0},0,"PROFESIÓN/OFICIO:"]
["c MIEMBRO PH",{"$f":"+B183","v":0},0,"DOMICILIO REAL:"]
["c MIEMBRO PH",{"$f":"+B184","v":0},0,"CEL/TEL :"]
["c MIEMBRO PH",{"$f":"IF(E186=0,0,B178)","v":0},{"$f":"IF(E186=0,0,C178)","v":0},"EMAIL:"]
["c MIEMBRO PH",{"$f":"B178","v":0},{"$f":"C178","v":0},"ESTADO CIVIL:"]
["c MIEMBRO PH",{"$f":"IF($E187=\"CASADO/A\",B178,0)","v":0},{"$f":"IF($E187=\"CASADO/A\",C178,0)","v":0},{"$f":"IF(E187=\"CASADO/A\",\"APELLIDO/S CÓNYUGE:\",\"\")","v":""}]
["c MIEMBRO PH",{"$f":"IF($E187=\"CASADO/A\",B178,0)","v":0},{"$f":"IF($E187=\"CASADO/A\",C178,0)","v":0},{"$f":"IF(E187=\"CASADO/A\",\"NOMBRE/S CÓNYUGE:\",\"\")","v":""}]
["c MIEMBRO PH",{"$f":"IF($E187=\"CASADO/A\",B178,0)","v":0},{"$f":"IF($E187=\"CASADO/A\",C178,0)","v":0},{"$f":"IF(E187=\"CASADO/A\",\"DOC. IDENTIDAD (cónyuge) –sin puntos ni barras-:\",\"\")","v":""}]
["g CONTRIB.",{"$f":"B178","v":0},{"$f":"B178","v":0},"CONTRIBUCIÓN -EN PESOS U OTRA MONEDA-:"]
["f PARTICIPACION",{"$f":"+B178","v":0},{"$f":"+C178","v":0},"PARTICIPACIÓN S/FONDO COMÚN OPERATIVO (%):",{"$f":"E191/'DATOS UT'!$E$32","v":{"$error":"#DIV/0!"}}]
["i ORG. REP. LEGAL/ ADM.",{"$f":"IF(E193=0,0,B178)","v":0},{"$f":"IF(E193=0,0,C178)","v":0},"NOMBRE CARGO REP. LEGAL/ ADMINISTRACIÓN QUE OCUPA:"]
["j ORG. FISCALIZ.",{"$f":"IF(E194=0,0,B179)","v":0},{"$f":"IF(E194=0,0,C179)","v":0},"NOMBRE CARGO FISCALIZACIÓN QUE OCUPA:"]
["c MIEMBRO PH",{"$f":"IF(E195=0,0,B178)","v":0},{"$f":"IF(E195=0,0,C178)","v":0},"NOTA/OBSERVACIÓN -en mayúscula-:"]
["c MIEMBRO PH",null,0,"DOC. IDENTIDAD –sin puntos-:"]
["c MIEMBRO PH",{"$f":"+B196","v":0},{"$f":"+C196","v":0},"CUIT/CUIL –sin puntos ni barras-:"]
["c MIEMBRO PH",{"$f":"+B197","v":0},0,"FECHA DE NACIMIENTO –dd/mm/aa-:"]
["c MIEMBRO PH",{"$f":"+B198","v":0},0,"LUGAR DE NACIMIENTO:"]
["c MIEMBRO PH",{"$f":"+B199","v":0},0,"NACIONALIDAD:"]
["c MIEMBRO PH",{"$f":"+B200","v":0},0,"PROFESIÓN/OFICIO:"]
["c MIEMBRO PH",{"$f":"+B201","v":0},0,"DOMICILIO REAL:"]
["c MIEMBRO PH",{"$f":"+B202","v":0},0,"CEL/TEL :"]
["c MIEMBRO PH",{"$f":"IF(E204=0,0,B196)","v":0},{"$f":"IF(E204=0,0,C196)","v":0},"EMAIL:"]
["c MIEMBRO PH",{"$f":"B196","v":0},{"$f":"C196","v":0},"ESTADO CIVIL:"]
["c MIEMBRO PH",{"$f":"IF($E205=\"CASADO/A\",B196,0)","v":0},{"$f":"IF($E205=\"CASADO/A\",C196,0)","v":0},{"$f":"IF(E205=\"CASADO/A\",\"APELLIDO/S CÓNYUGE:\",\"\")","v":""}]
["c MIEMBRO PH",{"$f":"IF($E205=\"CASADO/A\",B196,0)","v":0},{"$f":"IF($E205=\"CASADO/A\",C196,0)","v":0},{"$f":"IF(E205=\"CASADO/A\",\"NOMBRE/S CÓNYUGE:\",\"\")","v":""}]
["c MIEMBRO PH",{"$f":"IF($E205=\"CASADO/A\",B196,0)","v":0},{"$f":"IF($E205=\"CASADO/A\",C196,0)","v":0},{"$f":"IF(E205=\"CASADO/A\",\"DOC. IDENTIDAD (cónyuge) –sin puntos ni barras-:\",\"\")","v":""}]
["g CONTRIB.",{"$f":"B196","v":0},{"$f":"B196","v":0},"CONTRIBUCIÓN -EN PESOS U OTRA MONEDA-:"]
["f PARTICIPACION",{"$f":"+B196","v":0},{"$f":"+C196","v":0},"PARTICIPACIÓN S/FONDO COMÚN OPERATIVO (%):",{"$f":"E209/'DATOS UT'!$E$32","v":{"$error":"#DIV/0!"}}]
["i ORG. REP. LEGAL/ ADM.",{"$f":"IF(E211=0,0,B196)","v":0},{"$f":"IF(E211=0,0,C196)","v":0},"NOMBRE CARGO REP. LEGAL/ ADMINISTRACIÓN QUE OCUPA:"]
["j ORG. FISCALIZ.",{"$f":"IF(E212=0,0,B197)","v":0},{"$f":"IF(E212=0,0,C197)","v":0},"NOMBRE CARGO FISCALIZACIÓN QUE OCUPA:"]
["c MIEMBRO PH",{"$f":"IF(E213=0,0,B196)","v":0},{"$f":"IF(E213=0,0,C196)","v":0},"NOTA/OBSERVACIÓN -en mayúscula-:"]
["c MIEMBRO PH",null,0,"DOC. IDENTIDAD –sin puntos-:"]
["c MIEMBRO PH",{"$f":"+B214","v":0},{"$f":"+C214","v":0},"CUIT/CUIL –sin puntos ni barras-:"]
["c MIEMBRO PH",{"$f":"+B215","v":0},0,"FECHA DE NACIMIENTO –dd/mm/aa-:"]
["c MIEMBRO PH",{"$f":"+B216","v":0},0,"LUGAR DE NACIMIENTO:"]
["c MIEMBRO PH",{"$f":"+B217","v":0},0,"NACIONALIDAD:"]
["c MIEMBRO PH",{"$f":"+B218","v":0},0,"PROFESIÓN/OFICIO:"]
["c MIEMBRO PH",{"$f":"+B219","v":0},0,"DOMICILIO REAL:"]
["c MIEMBRO PH",{"$f":"+B220","v":0},0,"CEL/TEL :"]
["c MIEMBRO PH",{"$f":"IF(E222=0,0,B214)","v":0},{"$f":"IF(E222=0,0,C214)","v":0},"EMAIL:"]
["c MIEMBRO PH",{"$f":"B214","v":0},{"$f":"C214","v":0},"ESTADO CIVIL:"]
["c MIEMBRO PH",{"$f":"IF($E223=\"CASADO/A\",B214,0)","v":0},{"$f":"IF($E223=\"CASADO/A\",C214,0)","v":0},{"$f":"IF(E223=\"CASADO/A\",\"APELLIDO/S CÓNYUGE:\",\"\")","v":""}]
["c MIEMBRO PH",{"$f":"IF($E223=\"CASADO/A\",B214,0)","v":0},{"$f":"IF($E223=\"CASADO/A\",C214,0)","v":0},{"$f":"IF(E223=\"CASADO/A\",\"NOMBRE/S CÓNYUGE:\",\"\")","v":""}]
["c MIEMBRO PH",{"$f":"IF($E223=\"CASADO/A\",B214,0)","v":0},{"$f":"IF($E223=\"CASADO/A\",C214,0)","v":0},{"$f":"IF(E223=\"CASADO/A\",\"DOC. IDENTIDAD (cónyuge) –sin puntos ni barras-:\",\"\")","v":""}]
["g CONTRIB.",{"$f":"B214","v":0},{"$f":"B214","v":0},"CONTRIBUCIÓN -EN PESOS U OTRA MONEDA-:"]
["f PARTICIPACION",{"$f":"+B214","v":0},{"$f":"+C214","v":0},"PARTICIPACIÓN S/FONDO COMÚN OPERATIVO (%):",{"$f":"E227/'DATOS UT'!$E$32","v":{"$error":"#DIV/0!"}}]
["i ORG. REP. LEGAL/ ADM.",{"$f":"IF(E229=0,0,B214)","v":0},{"$f":"IF(E229=0,0,C214)","v":0},"NOMBRE CARGO REP. LEGAL/ ADMINISTRACIÓN QUE OCUPA:"]
["j ORG. FISCALIZ.",{"$f":"IF(E230=0,0,B215)","v":0},{"$f":"IF(E230=0,0,C215)","v":0},"NOMBRE CARGO FISCALIZACIÓN QUE OCUPA:"]
["c MIEMBRO PH",{"$f":"IF(E231=0,0,B214)","v":0},{"$f":"IF(E231=0,0,C214)","v":0},"NOTA/OBSERVACIÓN -en mayúscula-:"]
["c MIEMBRO PH",null,0,"DOC. IDENTIDAD –sin puntos-:"]
["c MIEMBRO PH",{"$f":"+B232","v":0},{"$f":"+C232","v":0},"CUIT/CUIL –sin puntos ni barras-:"]
["c MIEMBRO PH",{"$f":"+B233","v":0},0,"FECHA DE NACIMIENTO –dd/mm/aa-:"]
["c MIEMBRO PH",{"$f":"+B234","v":0},0,"LUGAR DE NACIMIENTO:"]
["c MIEMBRO PH",{"$f":"+B235","v":0},0,"NACIONALIDAD:"]
["c MIEMBRO PH",{"$f":"+B236","v":0},0,"PROFESIÓN/OFICIO:"]
["c MIEMBRO PH",{"$f":"+B237","v":0},0,"DOMICILIO REAL:"]
["c MIEMBRO PH",{"$f":"+B238","v":0},0,"CEL/TEL :"]
["c MIEMBRO PH",{"$f":"IF(E240=0,0,B232)","v":0},{"$f":"IF(E240=0,0,C232)","v":0},"EMAIL:"]
["c MIEMBRO PH",{"$f":"B232","v":0},{"$f":"C232","v":0},"ESTADO CIVIL:"]
["c MIEMBRO PH",{"$f":"IF($E241=\"CASADO/A\",B232,0)","v":0},{"$f":"IF($E241=\"CASADO/A\",C232,0)","v":0},{"$f":"IF(E241=\"CASADO/A\",\"APELLIDO/S CÓNYUGE:\",\"\")","v":""}]
["c MIEMBRO PH",{"$f":"IF($E241=\"CASADO/A\",B232,0)","v":0},{"$f":"IF($E241=\"CASADO/A\",C232,0)","v":0},{"$f":"IF(E241=\"CASADO/A\",\"NOMBRE/S CÓNYUGE:\",\"\")","v":""}]
["c MIEMBRO PH",{"$f":"IF($E241=\"CASADO/A\",B232,0)","v":0},{"$f":"IF($E241=\"CASADO/A\",C232,0)","v":0},{"$f":"IF(E241=\"CASADO/A\",\"DOC. IDENTIDAD (cónyuge) –sin puntos ni barras-:\",\"\")","v":""}]
["g CONTRIB.",{"$f":"B232","v":0},{"$f":"B232","v":0},"CONTRIBUCIÓN -EN PESOS U OTRA MONEDA-:"]
["f PARTICIPACION",{"$f":"+B232","v":0},{"$f":"+C232","v":0},"PARTICIPACIÓN S/FONDO COMÚN OPERATIVO (%):",{"$f":"E245/'DATOS UT'!$E$32","v":{"$error":"#DIV/0!"}}]
["i ORG. REP. LEGAL/ ADM.",{"$f":"IF(E247=0,0,B232)","v":0},{"$f":"IF(E247=0,0,C232)","v":0},"NOMBRE CARGO REP. LEGAL/ ADMINISTRACIÓN QUE OCUPA:"]
["j ORG. FISCALIZ.",{"$f":"IF(E248=0,0,B233)","v":0},{"$f":"IF(E248=0,0,C233)","v":0},"NOMBRE CARGO FISCALIZACIÓN QUE OCUPA:"]
["c MIEMBRO PH",{"$f":"IF(E249=0,0,B232)","v":0},{"$f":"IF(E249=0,0,C232)","v":0},"NOTA/OBSERVACIÓN -en mayúscula-:"]
["c MIEMBRO PH",null,0,"DOC. IDENTIDAD –sin puntos-:"]
["c MIEMBRO PH",{"$f":"+B250","v":0},{"$f":"+C250","v":0},"CUIT/CUIL –sin puntos ni barras-:"]
["c MIEMBRO PH",{"$f":"+B251","v":0},0,"FECHA DE NACIMIENTO –dd/mm/aa-:"]
["c MIEMBRO PH",{"$f":"+B252","v":0},0,"LUGAR DE NACIMIENTO:"]
["c MIEMBRO PH",{"$f":"+B253","v":0},0,"NACIONALIDAD:"]
["c MIEMBRO PH",{"$f":"+B254","v":0},0,"PROFESIÓN/OFICIO:"]
["c MIEMBRO PH",{"$f":"+B255","v":0},0,"DOMICILIO REAL:"]
["c MIEMBRO PH",{"$f":"+B256","v":0},0,"CEL/TEL :"]
["c MIEMBRO PH",{"$f":"IF(E258=0,0,B250)","v":0},{"$f":"IF(E258=0,0,C250)","v":0},"EMAIL:"]
["c MIEMBRO PH",{"$f":"B250","v":0},{"$f":"C250","v":0},"ESTADO CIVIL:"]
["c MIEMBRO PH",{"$f":"IF($E259=\"CASADO/A\",B250,0)","v":0},{"$f":"IF($E259=\"CASADO/A\",C250,0)","v":0},{"$f":"IF(E259=\"CASADO/A\",\"APELLIDO/S CÓNYUGE:\",\"\")","v":""}]
["c MIEMBRO PH",{"$f":"IF($E259=\"CASADO/A\",B250,0)","v":0},{"$f":"IF($E259=\"CASADO/A\",C250,0)","v":0},{"$f":"IF(E259=\"CASADO/A\",\"NOMBRE/S CÓNYUGE:\",\"\")","v":""}]
["c MIEMBRO PH",{"$f":"IF($E259=\"CASADO/A\",B250,0)","v":0},{"$f":"IF($E259=\"CASADO/A\",C250,0)","v":0},{"$f":"IF(E259=\"CASADO/A\",\"DOC. IDENTIDAD (cónyuge) –sin puntos ni barras-:\",\"\")","v":""}]
["g CONTRIB.",{"$f":"B250","v":0},{"$f":"B250","v":0},"CONTRIBUCIÓN -EN PESOS U OTRA MONEDA-:"]
["f PARTICIPACION",{"$f":"+B250","v":0},{"$f":"+C250","v":0},"PARTICIPACIÓN S/FONDO COMÚN OPERATIVO (%):",{"$f":"E263/'DATOS UT'!$E$32","v":{"$error":"#DIV/0!"}}]
["i ORG. REP. LEGAL/ ADM.",{"$f":"IF(E265=0,0,B250)","v":0},{"$f":"IF(E265=0,0,C250)","v":0},"NOMBRE CARGO REP. LEGAL/ ADMINISTRACIÓN QUE OCUPA:"]
["j ORG. FISCALIZ.",{"$f":"IF(E266=0,0,B251)","v":0},{"$f":"IF(E266=0,0,C251)","v":0},"NOMBRE CARGO FISCALIZACIÓN QUE OCUPA:"]
["c MIEMBRO PH",{"$f":"IF(E267=0,0,B250)","v":0},{"$f":"IF(E267=0,0,C250)","v":0},"NOTA/OBSERVACIÓN -en mayúscula-:"]

{"sheet":"NO MIEMBROS","index":3,"n_rows":247,"n_cols":4,"rows_kept":247,"cut":false,"hidden":false,"merged":[[1,0,1,4],[2,0,2,4],[3,0,3,2],[3,3,3,4],[6,3,6,4],[5,0,5,4]]}
[{"$f":"+'DATOS UT'!A1","v":"DATOS UNIÓN TRANSITORIA - act 2018/10"}]
["(COMPLETAR CELDAS CON FONDO VERDE)"]
["Juzgado Pcial 1era. Inst. en lo Civil, Comercial, Laboral y de Minería nro. UNO, Secretaría Registro Público de Comercio de Río Gallegos –Marcelino Alvarez 113, CP 9400-"]
["NOMBRE DE LA UNIÓN TRANSITORIA:",null,null,{"$f":"+'DATOS UT'!D4:E4","v":0}]
[null,"FECHA:",{"$f":"+'DATOS UT'!D5","v":"00:00:00"}]
["TERCEROS -NO MIEMBROS- INTEGRANTES DE LOS ORGANOS DE LAS UNIÓN TRANSITORIA"]
["REFER.","APELLIDO/s DEL TERCERO","APELLIDO/s DEL TERCERO","DATOS"]
["l NO MIEMBRO",null,null,"DOC. IDENTIDAD –sin puntos-:"]
["l NO MIEMBRO",{"$f":"B8","v":0},{"$f":"C8","v":0},"CUIT/CUIL –sin puntos ni barras-:"]
["l NO MIEMBRO",{"$f":"B8","v":0},{"$f":"C8","v":0},"FECHA DE NACIMIENTO –dd/mm/aa-:"]
["l NO MIEMBRO",{"$f":"B8","v":0},{"$f":"C8","v":0},"LUGAR DE NACIMIENTO:"]
["l NO MIEMBRO",{"$f":"B8","v":0},{"$f":"C8","v":0},"NACIONALIDAD:"]
["l NO MIEMBRO",{"$f":"B8","v":0},{"$f":"C8","v":0},"PROFESIÓN/OFICIO:"]
["l NO MIEMBRO",{"$f":"B8","v":0},{"$f":"C8","v":0},"DOMICILIO REAL:"]
["l NO MIEMBRO",{"$f":"B8","v":0},{"$f":"C8","v":0},"CEL/TEL :"]
["l NO MIEMBRO",{"$f":"+IF(E16=0,0,B8)","v":0},{"$f":"+IF(E16=0,0,C8)","v":0},"EMAIL:"]
["l NO MIEMBRO",{"$f":"B8","v":0},{"$f":"C8","v":0},"ESTADO CIVIL:"]
["l NO MIEMBRO",{"$f":"IF($E17=\"CASADO/A\",B8,0)","v":0},{"$f":"IF($E17=\"CASADO/A\",C8,0)","v":0},{"$f":"IF(E17=\"CASADO/A\",\"APELLIDO/S CÓNYUGE:\",\"\")","v":""}]
["l NO MIEMBRO",{"$f":"IF($E17=\"CASADO/A\",B8,0)","v":0},{"$f":"IF($E17=\"CASADO/A\",C8,0)","v":0},{"$f":"IF(E17=\"CASADO/A\",\"NOMBRE/S CÓNYUGE:\",\"\")","v":""}]
["l NO MIEMBRO",{"$f":"IF($E17=\"CASADO/A\",B8,0)","v":0},{"$f":"IF($E17=\"CASADO/A\",C8,0)","v":0},{"$f":"IF(E17=\"CASADO/A\",\"DOC. IDENTIDAD (cónyuge) –sin puntos ni barras-:\",\"\")","v":""}]
["i ORG. REP. LEGAL/ ADM.",{"$f":"IF(E21=0,0,B8)","v":0},{"$f":"IF(E21=0,0,C8)","v":0},"NOMBRE CARGO REP. LEGAL/ ADMINISTRACIÓN QUE OCUPA:"]
["j ORG. FISCALIZ.",{"$f":"IF(OR(E22=0,E22=\"PRESCINDE ART. 9 ACTO CONSTITUIVO\"),0,B8)","v":0},{"$f":"IF(OR(F22=0,E22=\"PRESCINDE ART.9 ACTO CONSTITUIVO\"),0,C8)","v":0},"NOMBRE CARGO FISCALIZACIÓN QUE OCUPA:"]
["l NO MIEMBRO",{"$f":"IF(E23=0,0,B8)","v":0},{"$f":"IF(E23=0,0,C8)","v":0},"NOTA/OBSERVACIÓN -en mayúscula-:"]
["l NO MIEMBRO",null,null,"DOC. IDENTIDAD –sin puntos-:"]
["l NO MIEMBRO",{"$f":"B24","v":0},{"$f":"C24","v":0},"CUIT/CUIL –sin puntos ni barras-:"]
["l NO MIEMBRO",{"$f":"B24","v":0},{"$f":"C24","v":0},"FECHA DE NACIMIENTO –dd/mm/aa-:"]
["l NO MIEMBRO",{"$f":"B24","v":0},{"$f":"C24","v":0},"LUGAR DE NACIMIENTO:"]
["l NO MIEMBRO",{"$f":"B24","v":0},{"$f":"C24","v":0},"NACIONALIDAD:"]
["l NO MIEMBRO",{"$f":"B24","v":0},{"$f":"C24","v":0},"PROFESIÓN/OFICIO:"]
["l NO MIEMBRO",{"$f":"B24","v":0},{"$f":"C24","v":0},"DOMICILIO REAL:"]
["l NO MIEMBRO",{"$f":"B24","v":0},{"$f":"C24","v":0},"CEL/TEL :"]
["l NO MIEMBRO",{"$f":"+IF(E32=0,0,B24)","v":0},{"$f":"+IF(E32=0,0,C24)","v":0},"EMAIL:"]
["l NO MIEMBRO",{"$f":"B24","v":0},{"$f":"C24","v":0},"ESTADO CIVIL:"]
["l NO MIEMBRO",{"$f":"IF($E33=\"CASADO/A\",B24,0)","v":0},{"$f":"IF($E33=\"CASADO/A\",C24,0)","v":0},{"$f":"IF(E33=\"CASADO/A\",\"APELLIDO/S CÓNYUGE:\",\"\")","v":""}]
["l NO MIEMBRO",{"$f":"IF($E33=\"CASADO/A\",B24,0)","v":0},{"$f":"IF($E33=\"CASADO/A\",C24,0)","v":0},{"$f":"IF(E33=\"CASADO/A\",\"NOMBRE/S CÓNYUGE:\",\"\")","v":""}]
["l NO MIEMBRO",{"$f":"IF($E33=\"CASADO/A\",B24,0)","v":0},{"$f":"IF($E33=\"CASADO/A\",C24,0)","v":0},{"$f":"IF(E33=\"CASADO/A\",\"DOC. IDENTIDAD (cónyuge) –sin puntos ni barras-:\",\"\")","v":""}]
["i ORG. REP. LEGAL/ ADM.",{"$f":"IF(E37=0,0,B24)","v":0},{"$f":"IF(E37=0,0,C24)","v":0},"NOMBRE CARGO REP. LEGAL/ ADMINISTRACIÓN QUE OCUPA:"]
["j ORG. FISCALIZ.",{"$f":"IF(OR(E38=0,E38=\"PRESCINDE ART. 9 ACTO CONSTITUIVO\"),0,B24)","v":0},{"$f":"IF(OR(F38=0,E38=\"PRESCINDE ART.9 ACTO CONSTITUIVO\"),0,C24)","v":0},"NOMBRE CARGO FISCALIZACIÓN QUE OCUPA:"]
["l NO MIEMBRO",{"$f":"IF(E39=0,0,B24)","v":0},{"$f":"IF(E39=0,0,C24)","v":0},"NOTA/OBSERVACIÓN -en mayúscula-:"]
["l NO MIEMBRO",null,null,"DOC. IDENTIDAD –sin puntos-:"]
["l NO MIEMBRO",{"$f":"B40","v":0},{"$f":"C40","v":0},"CUIT/CUIL –sin puntos ni barras-:"]
["l NO MIEMBRO",{"$f":"B40","v":0},{"$f":"C40","v":0},"FECHA DE NACIMIENTO –dd/mm/aa-:"]
["l NO MIEMBRO",{"$f":"B40","v":0},{"$f":"C40","v":0},"LUGAR DE NACIMIENTO:"]
["l NO MIEMBRO",{"$f":"B40","v":0},{"$f":"C40","v":0},"NACIONALIDAD:"]
["l NO MIEMBRO",{"$f":"B40","v":0},{"$f":"C40","v":0},"PROFESIÓN/OFICIO:"]
["l NO MIEMBRO",{"$f":"B40","v":0},{"$f":"C40","v":0},"DOMICILIO REAL:"]
["l NO MIEMBRO",{"$f":"B40","v":0},{"$f":"C40","v":0},"CEL/TEL :"]
["l NO MIEMBRO",{"$f":"+IF(E48=0,0,B40)","v":0},{"$f":"+IF(E48=0,0,C40)","v":0},"EMAIL:"]
["l NO MIEMBRO",{"$f":"B40","v":0},{"$f":"C40","v":0},"ESTADO CIVIL:"]
["l NO MIEMBRO",{"$f":"IF($E49=\"CASADO/A\",B40,0)","v":0},{"$f":"IF($E49=\"CASADO/A\",C40,0)","v":0},{"$f":"IF(E49=\"CASADO/A\",\"APELLIDO/S CÓNYUGE:\",\"\")","v":""}]
["l NO MIEMBRO",{"$f":"IF($E49=\"CASADO/A\",B40,0)","v":0},{"$f":"IF($E49=\"CASADO/A\",C40,0)","v":0},{"$f":"IF(E49=\"CASADO/A\",\"NOMBRE/S CÓNYUGE:\",\"\")","v":""}]
["l NO MIEMBRO",{"$f":"IF($E49=\"CASADO/A\",B40,0)","v":0},{"$f":"IF($E49=\"CASADO/A\",C40,0)","v":0},{"$f":"IF(E49=\"CASADO/A\",\"DOC. IDENTIDAD (cónyuge) –sin puntos ni barras-:\",\"\")","v":""}]
["i ORG. REP. LEGAL/ ADM.",{"$f":"IF(E53=0,0,B40)","v":0},{"$f":"IF(E53=0,0,C40)","v":0},"NOMBRE CARGO REP. LEGAL/ ADMINISTRACIÓN QUE OCUPA:"]
["j ORG. FISCALIZ.",{"$f":"IF(OR(E54=0,E54=\"PRESCINDE ART. 9 ACTO CONSTITUIVO\"),0,B40)","v":0},{"$f":"IF(OR(F54=0,E54=\"PRESCINDE ART.9 ACTO CONSTITUIVO\"),0,C40)","v":0},"NOMBRE CARGO FISCALIZACIÓN QUE OCUPA:"]
["l NO MIEMBRO",{"$f":"IF(E55=0,0,B40)","v":0},{"$f":"IF(E55=0,0,C40)","v":0},"NOTA/OBSERVACIÓN -en mayúscula-:"]
["l NO MIEMBRO",null,null,"DOC. IDENTIDAD –sin puntos-:"]
["l NO MIEMBRO",{"$f":"B56","v":0},{"$f":"C56","v":0},"CUIT/CUIL –sin puntos ni barras-:"]
["l NO MIEMBRO",{"$f":"B56","v":0},{"$f":"C56","v":0},"FECHA DE NACIMIENTO –dd/mm/aa-:"]
["l NO MIEMBRO",{"$f":"B56","v":0},{"$f":"C56","v":0},"LUGAR DE NACIMIENTO:"]
["l NO MIEMBRO",{"$f":"B56","v":0},{"$f":"C56","v":0},"NACIONALIDAD:"]
["l NO MIEMBRO",{"$f":"B56","v":0},{"$f":"C56","v":0},"PROFESIÓN/OFICIO:"]
["l NO MIEMBRO",{"$f":"B56","v":0},{"$f":"C56","v":0},"DOMICILIO REAL:"]
["l NO MIEMBRO",{"$f":"B56","v":0},{"$f":"C56","v":0},"CEL/TEL :"]
["l NO MIEMBRO",{"$f":"+IF(E64=0,0,B56)","v":0},{"$f":"+IF(E64=0,0,C56)","v":0},"EMAIL:"]
["l NO MIEMBRO",{"$f":"B56","v":0},{"$f":"C56","v":0},"ESTADO CIVIL:"]
["l NO MIEMBRO",{"$f":"IF($E65=\"CASADO/A\",B56,0)","v":0},{"$f":"IF($E65=\"CASADO/A\",C56,0)","v":0},{"$f":"IF(E65=\"CASADO/A\",\"APELLIDO/S CÓNYUGE:\",\"\")","v":""}]
["l NO MIEMBRO",{"$f":"IF($E65=\"CASADO/A\",B56,0)","v":0},{"$f":"IF($E65=\"CASADO/A\",C56,0)","v":0},{"$f":"IF(E65=\"CASADO/A\",\"NOMBRE/S CÓNYUGE:\",\"\")","v":""}]
["l NO MIEMBRO",{"$f":"IF($E65=\"CASADO/A\",B56,0)","v":0},{"$f":"IF($E65=\"CASADO/A\",C56,0)","v":0},{"$f":"IF(E65=\"CASADO/A\",\"DOC. IDENTIDAD (cónyuge) –sin puntos ni barras-:\",\"\")","v":""}]
["i ORG. REP. LEGAL/ ADM.",{"$f":"IF(E69=0,0,B56)","v":0},{"$f":"IF(E69=0,0,C56)","v":0},"NOMBRE CARGO REP. LEGAL/ ADMINISTRACIÓN QUE OCUPA:"]
["j ORG. FISCALIZ.",{"$f":"IF(OR(E70=0,E70=\"PRESCINDE ART. 9 ACTO CONSTITUIVO\"),0,B56)","v":0},{"$f":"IF(OR(F70=0,E70=\"PRESCINDE ART.9 ACTO CONSTITUIVO\"),0,C56)","v":0},"NOMBRE CARGO FISCALIZACIÓN QUE OCUPA:"]
["l NO MIEMBRO",{"$f":"IF(E71=0,0,B56)","v":0},{"$f":"IF(E71=0,0,C56)","v":0},"NOTA/OBSERVACIÓN -en mayúscula-:"]
["l NO MIEMBRO",null,null,"DOC. IDENTIDAD –sin puntos-:"]
["l NO MIEMBRO",{"$f":"B72","v":0},{"$f":"C72","v":0},"CUIT/CUIL –sin puntos ni barras-:"]
["l NO MIEMBRO",{"$f":"B72","v":0},{"$f":"C72","v":0},"FECHA DE NACIMIENTO –dd/mm/aa-:"]
["l NO MIEMBRO",{"$f":"B72","v":0},{"$f":"C72","v":0},"LUGAR DE NACIMIENTO:"]
["l NO MIEMBRO",{"$f":"B72","v":0},{"$f":"C72","v":0},"NACIONALIDAD:"]
["l NO MIEMBRO",{"$f":"B72","v":0},{"$f":"C72","v":0},"PROFESIÓN/OFICIO:"]
["l NO MIEMBRO",{"$f":"B72","v":0},{"$f":"C72","v":0},"DOMICILIO REAL:"]
["l NO MIEMBRO",{"$f":"B72","v":0},{"$f":"C72","v":0},"CEL/TEL :"]
["l NO MIEMBRO",{"$f":"+IF(E80=0,0,B72)","v":0},{"$f":"+IF(E80=0,0,C72)","v":0},"EMAIL:"]
["l NO MIEMBRO",{"$f":"B72","v":0},{"$f":"C72","v":0},"ESTADO CIVIL:"]
["l NO MIEMBRO",{"$f":"IF($E81=\"CASADO/A\",B72,0)","v":0},{"$f":"IF($E81=\"CASADO/A\",C72,0)","v":0},{"$f":"IF(E81=\"CASADO/A\",\"APELLIDO/S CÓNYUGE:\",\"\")","v":""}]
["l NO MIEMBRO",{"$f":"IF($E81=\"CASADO/A\",B72,0)","v":0},{"$f":"IF($E81=\"CASADO/A\",C72,0)","v":0},{"$f":"IF(E81=\"CASADO/A\",\"NOMBRE/S CÓNYUGE:\",\"\")","v":""}]
["l NO MIEMBRO",{"$f":"IF($E81=\"CASADO/A\",B72,0)","v":0},{"$f":"IF($E81=\"CASADO/A\",C72,0)","v":0},{"$f":"IF(E81=\"CASADO/A\",\"DOC. IDENTIDAD (cónyuge) –sin puntos ni barras-:\",\"\")","v":""}]
["i ORG. REP. LEGAL/ ADM.",{"$f":"IF(E85=0,0,B72)","v":0},{"$f":"IF(E85=0,0,C72)","v":0},"NOMBRE CARGO REP. LEGAL/ ADMINISTRACIÓN QUE OCUPA:"]
["j ORG. FISCALIZ.",{"$f":"IF(OR(E86=0,E86=\"PRESCINDE ART. 9 ACTO CONSTITUIVO\"),0,B72)","v":0},{"$f":"IF(OR(F86=0,E86=\"PRESCINDE ART.9 ACTO CONSTITUIVO\"),0,C72)","v":0},"NOMBRE CARGO FISCALIZACIÓN QUE OCUPA:"]
["l NO MIEMBRO",{"$f":"IF(E87=0,0,B72)","v":0},{"$f":"IF(E87=0,0,C72)","v":0},"NOTA/OBSERVACIÓN -en mayúscula-:"]
["l NO MIEMBRO",null,null,"DOC. IDENTIDAD –sin puntos-:"]
["l NO MIEMBRO",{"$f":"B88","v":0},{"$f":"C88","v":0},"CUIT/CUIL –sin puntos ni barras-:"]
["l NO MIEMBRO",{"$f":"B88","v":0},{"$f":"C88","v":0},"FECHA DE NACIMIENTO –dd/mm/aa-:"]
["l NO MIEMBRO",{"$f":"B88","v":0},{"$f":"C88","v":0},"LUGAR DE NACIMIENTO:"]
["l NO MIEMBRO",{"$f":"B88","v":0},{"$f":"C88","v":0},"NACIONALIDAD:"]
["l NO MIEMBRO",{"$f":"B88","v":0},{"$f":"C88","v":0},"PROFESIÓN/OFICIO:"]
["l NO MIEMBRO",{"$f":"B88","v":0},{"$f":"C88","v":0},"DOMICILIO REAL:"]
["l NO MIEMBRO",{"$f":"B88","v":0},{"$f":"C88","v":0},"CEL/TEL :"]
["l NO MIEMBRO",{"$f":"+IF(E96=0,0,B88)","v":0},{"$f":"+IF(E96=0,0,C88)","v":0},"EMAIL:"]
["l NO MIEMBRO",{"$f":"B88","v":0},{"$f":"C88","v":0},"ESTADO CIVIL:"]
["l NO MIEMBRO",{"$f":"IF($E97=\"CASADO/A\",B88,0)","v":0},{"$f":"IF($E97=\"CASADO/A\",C88,0)","v":0},{"$f":"IF(E97=\"CASADO/A\",\"APELLIDO/S CÓNYUGE:\",\"\")","v":""}]
["l NO MIEMBRO",{"$f":"IF($E97=\"CASADO/A\",B88,0)","v":0},{"$f":"IF($E97=\"CASADO/A\",C88,0)","v":0},{"$f":"IF(E97=\"CASADO/A\",\"NOMBRE/S CÓNYUGE:\",\"\")","v":""}]
["l NO MIEMBRO",{"$f":"IF($E97=\"CASADO/A\",B88,0)","v":0},{"$f":"IF($E97=\"CASADO/A\",C88,0)","v":0},{"$f":"IF(E97=\"CASADO/A\",\"DOC. IDENTIDAD (cónyuge) –sin puntos ni barras-:\",\"\")","v":""}]
["i ORG. REP. LEGAL/ ADM.",{"$f":"IF(E101=0,0,B88)","v":0},{"$f":"IF(E101=0,0,C88)","v":0},"NOMBRE CARGO REP. LEGAL/ ADMINISTRACIÓN QUE OCUPA:"]
["j ORG. FISCALIZ.",{"$f":"IF(OR(E102=0,E102=\"PRESCINDE ART. 9 ACTO CONSTITUIVO\"),0,B88)","v":0},{"$f":"IF(OR(F102=0,E102=\"PRESCINDE ART.9 ACTO CONSTITUIVO\"),0,C88)","v":0},"NOMBRE CARGO FISCALIZACIÓN QUE OCUPA:"]
["l NO MIEMBRO",{"$f":"IF(E103=0,0,B88)","v":0},{"$f":"IF(E103=0,0,C88)","v":0},"NOTA/OBSERVACIÓN -en mayúscula-:"]
["l NO MIEMBRO",null,null,"DOC. IDENTIDAD –sin puntos-:"]
["l NO MIEMBRO",{"$f":"B104","v":0},{"$f":"C104","v":0},"CUIT/CUIL –sin puntos ni barras-:"]
["l NO MIEMBRO",{"$f":"B104","v":0},{"$f":"C104","v":0},"FECHA DE NACIMIENTO –dd/mm/aa-:"]
["l NO MIEMBRO",{"$f":"B104","v":0},{"$f":"C104","v":0},"LUGAR DE NACIMIENTO:"]
["l NO MIEMBRO",{"$f":"B104","v":0},{"$f":"C104","v":0},"NACIONALIDAD:"]
["l NO MIEMBRO",{"$f":"B104","v":0},{"$f":"C104","v":0},"PROFESIÓN/OFICIO:"]
["l NO MIEMBRO",{"$f":"B104","v":0},{"$f":"C104","v":0},"DOMICILIO REAL:"]
["l NO MIEMBRO",{"$f":"B104","v":0},{"$f":"C104","v":0},"CEL/TEL :"]
["l NO MIEMBRO",{"$f":"+IF(E112=0,0,B104)","v":0},{"$f":"+IF(E112=0,0,C104)","v":0},"EMAIL:"]
["l NO MIEMBRO",{"$f":"B104","v":0},{"$f":"C104","v":0},"ESTADO CIVIL:"]
["l NO MIEMBRO",{"$f":"IF($E113=\"CASADO/A\",B104,0)","v":0},{"$f":"IF($E113=\"CASADO/A\",C104,0)","v":0},{"$f":"IF(E113=\"CASADO/A\",\"APELLIDO/S CÓNYUGE:\",\"\")","v":""}]
["l NO MIEMBRO",{"$f":"IF($E113=\"CASADO/A\",B104,0)","v":0},{"$f":"IF($E113=\"CASADO/A\",C104,0)","v":0},{"$f":"IF(E113=\"CASADO/A\",\"NOMBRE/S CÓNYUGE:\",\"\")","v":""}]
["l NO MIEMBRO",{"$f":"IF($E113=\"CASADO/A\",B104,0)","v":0},{"$f":"IF($E113=\"CASADO/A\",C104,0)","v":0},{"$f":"IF(E113=\"CASADO/A\",\"DOC. IDENTIDAD (cónyuge) –sin puntos ni barras-:\",\"\")","v":""}]
["i ORG. REP. LEGAL/ ADM.",{"$f":"IF(E117=0,0,B104)","v":0},{"$f":"IF(E117=0,0,C104)","v":0},"NOMBRE CARGO REP. LEGAL/ ADMINISTRACIÓN QUE OCUPA:"]
["j ORG. FISCALIZ.",{"$f":"IF(OR(E118=0,E118=\"PRESCINDE ART. 9 ACTO CONSTITUIVO\"),0,B104)","v":0},{"$f":"IF(OR(F118=0,E118=\"PRESCINDE ART.9 ACTO CONSTITUIVO\"),0,C104)","v":0},"NOMBRE CARGO FISCALIZACIÓN QUE OCUPA:"]
["l NO MIEMBRO",{"$f":"IF(E119=0,0,B104)","v":0},{"$f":"IF(E119=0,0,C104)","v":0},"NOTA/OBSERVACIÓN -en mayúscula-:"]
["l NO MIEMBRO",null,null,"DOC. IDENTIDAD –sin puntos-:"]
["l NO MIEMBRO",{"$f":"B120","v":0},{"$f":"C120","v":0},"CUIT/CUIL –sin puntos ni barras-:"]
["l NO MIEMBRO",{"$f":"B120","v":0},{"$f":"C120","v":0},"FECHA DE NACIMIENTO –dd/mm/aa-:"]
["l NO MIEMBRO",{"$f":"B120","v":0},{"$f":"C120","v":0},"LUGAR DE NACIMIENTO:"]
["l NO MIEMBRO",{"$f":"B120","v":0},{"$f":"C120","v":0},"NACIONALIDAD:"]
["l NO MIEMBRO",{"$f":"B120","v":0},{"$f":"C120","v":0},"PROFESIÓN/OFICIO:"]
["l NO MIEMBRO",{"$f":"B120","v":0},{"$f":"C120","v":0},"DOMICILIO REAL:"]
["l NO MIEMBRO",{"$f":"B120","v":0},{"$f":"C120","v":0},"CEL/TEL :"]
["l NO MIEMBRO",{"$f":"+IF(E128=0,0,B120)","v":0},{"$f":"+IF(E128=0,0,C120)","v":0},"EMAIL:"]
["l NO MIEMBRO",{"$f":"B120","v":0},{"$f":"C120","v":0},"ESTADO CIVIL:"]
["l NO MIEMBRO",{"$f":"IF($E129=\"CASADO/A\",B120,0)","v":0},{"$f":"IF($E129=\"CASADO/A\",C120,0)","v":0},{"$f":"IF(E129=\"CASADO/A\",\"APELLIDO/S CÓNYUGE:\",\"\")","v":""}]
["l NO MIEMBRO",{"$f":"IF($E129=\"CASADO/A\",B120,0)","v":0},{"$f":"IF($E129=\"CASADO/A\",C120,0)","v":0},{"$f":"IF(E129=\"CASADO/A\",\"NOMBRE/S CÓNYUGE:\",\"\")","v":""}]
["l NO MIEMBRO",{"$f":"IF($E129=\"CASADO/A\",B120,0)","v":0},{"$f":"IF($E129=\"CASADO/A\",C120,0)","v":0},{"$f":"IF(E129=\"CASADO/A\",\"DOC. IDENTIDAD (cónyuge) –sin puntos ni barras-:\",\"\")","v":""}]
["i ORG. REP. LEGAL/ ADM.",{"$f":"IF(E133=0,0,B120)","v":0},{"$f":"IF(E133=0,0,C120)","v":0},"NOMBRE CARGO REP. LEGAL/ ADMINISTRACIÓN QUE OCUPA:"]
["j ORG. FISCALIZ.",{"$f":"IF(OR(E134=0,E134=\"PRESCINDE ART. 9 ACTO CONSTITUIVO\"),0,B120)","v":0},{"$f":"IF(OR(F134=0,E134=\"PRESCINDE ART.9 ACTO CONSTITUIVO\"),0,C120)","v":0},"NOMBRE CARGO FISCALIZACIÓN QUE OCUPA:"]
["l NO MIEMBRO",{"$f":"IF(E135=0,0,B120)","v":0},{"$f":"IF(E135=0,0,C120)","v":0},"NOTA/OBSERVACIÓN -en mayúscula-:"]
["l NO MIEMBRO",null,null,"DOC. IDENTIDAD –sin puntos-:"]
["l NO MIEMBRO",{"$f":"B136","v":0},{"$f":"C136","v":0},"CUIT/CUIL –sin puntos ni barras-:"]
["l NO MIEMBRO",{"$f":"B136","v":0},{"$f":"C136","v":0},"FECHA DE NACIMIENTO –dd/mm/aa-:"]
["l NO MIEMBRO",{"$f":"B136","v":0},{"$f":"C136","v":0},"LUGAR DE NACIMIENTO:"]
["l NO MIEMBRO",{"$f":"B136","v":0},{"$f":"C136","v":0},"NACIONALIDAD:"]
["l NO MIEMBRO",{"$f":"B136","v":0},{"$f":"C136","v":0},"PROFESIÓN/OFICIO:"]
["l NO MIEMBRO",{"$f":"B136","v":0},{"$f":"C136","v":0},"DOMICILIO REAL:"]
["l NO MIEMBRO",{"$f":"B136","v":0},{"$f":"C136","v":0},"CEL/TEL :"]
["l NO MIEMBRO",{"$f":"+IF(E144=0,0,B136)","v":0},{"$f":"+IF(E144=0,0,C136)","v":0},"EMAIL:"]
["l NO MIEMBRO",{"$f":"B136","v":0},{"$f":"C136","v":0},"ESTADO CIVIL:"]
["l NO MIEMBRO",{"$f":"IF($E145=\"CASADO/A\",B136,0)","v":0},{"$f":"IF($E145=\"CASADO/A\",C136,0)","v":0},{"$f":"IF(E145=\"CASADO/A\",\"APELLIDO/S CÓNYUGE:\",\"\")","v":""}]
["l NO MIEMBRO",{"$f":"IF($E145=\"CASADO/A\",B136,0)","v":0},{"$f":"IF($E145=\"CASADO/A\",C136,0)","v":0},{"$f":"IF(E145=\"CASADO/A\",\"NOMBRE/S CÓNYUGE:\",\"\")","v":""}]
["l NO MIEMBRO",{"$f":"IF($E145=\"CASADO/A\",B136,0)","v":0},{"$f":"IF($E145=\"CASADO/A\",C136,0)","v":0},{"$f":"IF(E145=\"CASADO/A\",\"DOC. IDENTIDAD (cónyuge) –sin puntos ni barras-:\",\"\")","v":""}]
["i ORG. REP. LEGAL/ ADM.",{"$f":"IF(E149=0,0,B136)","v":0},{"$f":"IF(E149=0,0,C136)","v":0},"NOMBRE CARGO REP. LEGAL/ ADMINISTRACIÓN QUE OCUPA:"]
["j ORG. FISCALIZ.",{"$f":"IF(OR(E150=0,E150=\"PRESCINDE ART. 9 ACTO CONSTITUIVO\"),0,B136)","v":0},{"$f":"IF(OR(F150=0,E150=\"PRESCINDE ART.9 ACTO CONSTITUIVO\"),0,C136)","v":0},"NOMBRE CARGO FISCALIZACIÓN QUE OCUPA:"]
["l NO MIEMBRO",{"$f":"IF(E151=0,0,B136)","v":0},{"$f":"IF(E151=0,0,C136)","v":0},"NOTA/OBSERVACIÓN -en mayúscula-:"]
["l NO MIEMBRO",null,null,"DOC. IDENTIDAD –sin puntos-:"]
["l NO MIEMBRO",{"$f":"B152","v":0},{"$f":"C152","v":0},"CUIT/CUIL –sin puntos ni barras-:"]
["l NO MIEMBRO",{"$f":"B152","v":0},{"$f":"C152","v":0},"FECHA DE NACIMIENTO –dd/mm/aa-:"]
["l NO MIEMBRO",{"$f":"B152","v":0},{"$f":"C152","v":0},"LUGAR DE NACIMIENTO:"]
["l NO MIEMBRO",{"$f":"B152","v":0},{"$f":"C152","v":0},"NACIONALIDAD:"]
["l NO MIEMBRO",{"$f":"B152","v":0},{"$f":"C152","v":0},"PROFESIÓN/OFICIO:"]
["l NO MIEMBRO",{"$f":"B152","v":0},{"$f":"C152","v":0},"DOMICILIO REAL:"]
["l NO MIEMBRO",{"$f":"B152","v":0},{"$f":"C152","v":0},"CEL/TEL :"]
["l NO MIEMBRO",{"$f":"+IF(E160=0,0,B152)","v":0},{"$f":"+IF(E160=0,0,C152)","v":0},"EMAIL:"]
["l NO MIEMBRO",{"$f":"B152","v":0},{"$f":"C152","v":0},"ESTADO CIVIL:"]
["l NO MIEMBRO",{"$f":"IF($E161=\"CASADO/A\",B152,0)","v":0},{"$f":"IF($E161=\"CASADO/A\",C152,0)","v":0},{"$f":"IF(E161=\"CASADO/A\",\"APELLIDO/S CÓNYUGE:\",\"\")","v":""}]
["l NO MIEMBRO",{"$f":"IF($E161=\"CASADO/A\",B152,0)","v":0},{"$f":"IF($E161=\"CASADO/A\",C152,0)","v":0},{"$f":"IF(E161=\"CASADO/A\",\"NOMBRE/S CÓNYUGE:\",\"\")","v":""}]
["l NO MIEMBRO",{"$f":"IF($E161=\"CASADO/A\",B152,0)","v":0},{"$f":"IF($E161=\"CASADO/A\",C152,0)","v":0},{"$f":"IF(E161=\"CASADO/A\",\"DOC. IDENTIDAD (cónyuge) –sin puntos ni barras-:\",\"\")","v":""}]
["i ORG. REP. LEGAL/ ADM.",{"$f":"IF(E165=0,0,B152)","v":0},{"$f":"IF(E165=0,0,C152)","v":0},"NOMBRE CARGO REP. LEGAL/ ADMINISTRACIÓN QUE OCUPA:"]
["j ORG. FISCALIZ.",{"$f":"IF(OR(E166=0,E166=\"PRESCINDE ART. 9 ACTO CONSTITUIVO\"),0,B152)","v":0},{"$f":"IF(OR(F166=0,E166=\"PRESCINDE ART.9 ACTO CONSTITUIVO\"),0,C152)","v":0},"NOMBRE CARGO FISCALIZACIÓN QUE OCUPA:"]
["l NO MIEMBRO",{"$f":"IF(E167=0,0,B152)","v":0},{"$f":"IF(E167=0,0,C152)","v":0},"NOTA/OBSERVACIÓN -en mayúscula-:"]
["l NO MIEMBRO",null,null,"DOC. IDENTIDAD –sin puntos-:"]
["l NO MIEMBRO",{"$f":"B168","v":0},{"$f":"C168","v":0},"CUIT/CUIL –sin puntos ni barras-:"]
["l NO MIEMBRO",{"$f":"B168","v":0},{"$f":"C168","v":0},"FECHA DE NACIMIENTO –dd/mm/aa-:"]
["l NO MIEMBRO",{"$f":"B168","v":0},{"$f":"C168","v":0},"LUGAR DE NACIMIENTO:"]
["l NO MIEMBRO",{"$f":"B168","v":0},{"$f":"C168","v":0},"NACIONALIDAD:"]
["l NO MIEMBRO",{"$f":"B168","v":0},{"$f":"C168","v":0},"PROFESIÓN/OFICIO:"]
["l NO MIEMBRO",{"$f":"B168","v":0},{"$f":"C168","v":0},"DOMICILIO REAL:"]
["l NO MIEMBRO",{"$f":"B168","v":0},{"$f":"C168","v":0},"CEL/TEL :"]
["l NO MIEMBRO",{"$f":"+IF(E176=0,0,B168)","v":0},{"$f":"+IF(E176=0,0,C168)","v":0},"EMAIL:"]
["l NO MIEMBRO",{"$f":"B168","v":0},{"$f":"C168","v":0},"ESTADO CIVIL:"]
["l NO MIEMBRO",{"$f":"IF($E177=\"CASADO/A\",B168,0)","v":0},{"$f":"IF($E177=\"CASADO/A\",C168,0)","v":0},{"$f":"IF(E177=\"CASADO/A\",\"APELLIDO/S CÓNYUGE:\",\"\")","v":""}]
["l NO MIEMBRO",{"$f":"IF($E177=\"CASADO/A\",B168,0)","v":0},{"$f":"IF($E177=\"CASADO/A\",C168,0)","v":0},{"$f":"IF(E177=\"CASADO/A\",\"NOMBRE/S CÓNYUGE:\",\"\")","v":""}]
["l NO MIEMBRO",{"$f":"IF($E177=\"CASADO/A\",B168,0)","v":0},{"$f":"IF($E177=\"CASADO/A\",C168,0)","v":0},{"$f":"IF(E177=\"CASADO/A\",\"DOC. IDENTIDAD (cónyuge) –sin puntos ni barras-:\",\"\")","v":""}]
["i ORG. REP. LEGAL/ ADM.",{"$f":"IF(E181=0,0,B168)","v":0},{"$f":"IF(E181=0,0,C168)","v":0},"NOMBRE CARGO REP. LEGAL/ ADMINISTRACIÓN QUE OCUPA:"]
["j ORG. FISCALIZ.",{"$f":"IF(OR(E182=0,E182=\"PRESCINDE ART. 9 ACTO CONSTITUIVO\"),0,B168)","v":0},{"$f":"IF(OR(F182=0,E182=\"PRESCINDE ART.9 ACTO CONSTITUIVO\"),0,C168)","v":0},"NOMBRE CARGO FISCALIZACIÓN QUE OCUPA:"]
["l NO MIEMBRO",{"$f":"IF(E183=0,0,B168)","v":0},{"$f":"IF(E183=0,0,C168)","v":0},"NOTA/OBSERVACIÓN -en mayúscula-:"]
["l NO MIEMBRO",null,null,"DOC. IDENTIDAD –sin puntos-:"]
["l NO MIEMBRO",{"$f":"B184","v":0},{"$f":"C184","v":0},"CUIT/CUIL –sin puntos ni barras-:"]
["l NO MIEMBRO",{"$f":"B184","v":0},{"$f":"C184","v":0},"FECHA DE NACIMIENTO –dd/mm/aa-:"]
["l NO MIEMBRO",{"$f":"B184","v":0},{"$f":"C184","v":0},"LUGAR DE NACIMIENTO:"]
["l NO MIEMBRO",{"$f":"B184","v":0},{"$f":"C184","v":0},"NACIONALIDAD:"]
["l NO MIEMBRO",{"$f":"B184","v":0},{"$f":"C184","v":0},"PROFESIÓN/OFICIO:"]
["l NO MIEMBRO",{"$f":"B184","v":0},{"$f":"C184","v":0},"DOMICILIO REAL:"]
["l NO MIEMBRO",{"$f":"B184","v":0},{"$f":"C184","v":0},"CEL/TEL :"]
["l NO MIEMBRO",{"$f":"+IF(E192=0,0,B184)","v":0},{"$f":"+IF(E192=0,0,C184)","v":0},"EMAIL:"]
["l NO MIEMBRO",{"$f":"B184","v":0},{"$f":"C184","v":0},"ESTADO CIVIL:"]
["l NO MIEMBRO",{"$f":"IF($E193=\"CASADO/A\",B184,0)","v":0},{"$f":"IF($E193=\"CASADO/A\",C184,0)","v":0},{"$f":"IF(E193=\"CASADO/A\",\"APELLIDO/S CÓNYUGE:\",\"\")","v":""}]
["l NO MIEMBRO",{"$f":"IF($E193=\"CASADO/A\",B184,0)","v":0},{"$f":"IF($E193=\"CASADO/A\",C184,0)","v":0},{"$f":"IF(E193=\"CASADO/A\",\"NOMBRE/S CÓNYUGE:\",\"\")","v":""}]
["l NO MIEMBRO",{"$f":"IF($E193=\"CASADO/A\",B184,0)","v":0},{"$f":"IF($E193=\"CASADO/A\",C184,0)","v":0},{"$f":"IF(E193=\"CASADO/A\",\"DOC. IDENTIDAD (cónyuge) –sin puntos ni barras-:\",\"\")","v":""}]
["i ORG. REP. LEGAL/ ADM.",{"$f":"IF(E197=0,0,B184)","v":0},{"$f":"IF(E197=0,0,C184)","v":0},"NOMBRE CARGO REP. LEGAL/ ADMINISTRACIÓN QUE OCUPA:"]
["j ORG. FISCALIZ.",{"$f":"IF(OR(E198=0,E198=\"PRESCINDE ART. 9 ACTO CONSTITUIVO\"),0,B184)","v":0},{"$f":"IF(OR(F198=0,E198=\"PRESCINDE ART.9 ACTO CONSTITUIVO\"),0,C184)","v":0},"NOMBRE CARGO FISCALIZACIÓN QUE OCUPA:"]
["l NO MIEMBRO",{"$f":"IF(E199=0,0,B184)","v":0},{"$f":"IF(E199=0,0,C184)","v":0},"NOTA/OBSERVACIÓN -en mayúscula-:"]
["l NO MIEMBRO",null,null,"DOC. IDENTIDAD –sin puntos-:"]
["l NO MIEMBRO",{"$f":"B200","v":0},{"$f":"C200","v":0},"CUIT/CUIL –sin puntos ni barras-:"]
["l NO MIEMBRO",{"$f":"B200","v":0},{"$f":"C200","v":0},"FECHA DE NACIMIENTO –dd/mm/aa-:"]
["l NO MIEMBRO",{"$f":"B200","v":0},{"$f":"C200","v":0},"LUGAR DE NACIMIENTO:"]
["l NO MIEMBRO",{"$f":"B200","v":0},{"$f":"C200","v":0},"NACIONALIDAD:"]
["l NO MIEMBRO",{"$f":"B200","v":0},{"$f":"C200","v":0},"PROFESIÓN/OFICIO:"]
["l NO MIEMBRO",{"$f":"B200","v":0},{"$f":"C200","v":0},"DOMICILIO REAL:"]
["l NO MIEMBRO",{"$f":"B200","v":0},{"$f":"C200","v":0},"CEL/TEL :"]
["l NO MIEMBRO",{"$f":"+IF(E208=0,0,B200)","v":0},{"$f":"+IF(E208=0,0,C200)","v":0},"EMAIL:"]
["l NO MIEMBRO",{"$f":"B200","v":0},{"$f":"C200","v":0},"ESTADO CIVIL:"]
["l NO MIEMBRO",{"$f":"IF($E209=\"CASADO/A\",B200,0)","v":0},{"$f":"IF($E209=\"CASADO/A\",C200,0)","v":0},{"$f":"IF(E209=\"CASADO/A\",\"APELLIDO/S CÓNYUGE:\",\"\")","v":""}]
["l NO MIEMBRO",{"$f":"IF($E209=\"CASADO/A\",B200,0)","v":0},{"$f":"IF($E209=\"CASADO/A\",C200,0)","v":0},{"$f":"IF(E209=\"CASADO/A\",\"NOMBRE/S CÓNYUGE:\",\"\")","v":""}]
["l NO MIEMBRO",{"$f":"IF($E209=\"CASADO/A\",B200,0)","v":0},{"$f":"IF($E209=\"CASADO/A\",C200,0)","v":0},{"$f":"IF(E209=\"CASADO/A\",\"DOC. IDENTIDAD (cónyuge) –sin puntos ni barras-:\",\"\")","v":""}]
["i ORG. REP. LEGAL/ ADM.",{"$f":"IF(E213=0,0,B200)","v":0},{"$f":"IF(E213=0,0,C200)","v":0},"NOMBRE CARGO REP. LEGAL/ ADMINISTRACIÓN QUE OCUPA:"]
["j ORG. FISCALIZ.",{"$f":"IF(OR(E214=0,E214=\"PRESCINDE ART. 9 ACTO CONSTITUIVO\"),0,B200)","v":0},{"$f":"IF(OR(F214=0,E214=\"PRESCINDE ART.9 ACTO CONSTITUIVO\"),0,C200)","v":0},"NOMBRE CARGO FISCALIZACIÓN QUE OCUPA:"]
["l NO MIEMBRO",{"$f":"IF(E215=0,0,B200)","v":0},{"$f":"IF(E215=0,0,C200)","v":0},"NOTA/OBSERVACIÓN -en mayúscula-:"]
["l NO MIEMBRO",null,null,"DOC. IDENTIDAD –sin puntos-:"]
["l NO MIEMBRO",{"$f":"B216","v":0},{"$f":"C216","v":0},"CUIT/CUIL –sin puntos ni barras-:"]
["l NO MIEMBRO",{"$f":"B216","v":0},{"$f":"C216","v":0},"FECHA DE NACIMIENTO –dd/mm/aa-:"]
["l NO MIEMBRO",{"$f":"B216","v":0},{"$f":"C216","v":0},"LUGAR DE NACIMIENTO:"]
["l NO MIEMBRO",{"$f":"B216","v":0},{"$f":"C216","v":0},"NACIONALIDAD:"]
["l NO MIEMBRO",{"$f":"B216","v":0},{"$f":"C216","v":0},"PROFESIÓN/OFICIO:"]
["l NO MIEMBRO",{"$f":"B216","v":0},{"$f":"C216","v":0},"DOMICILIO REAL:"]
["l NO MIEMBRO",{"$f":"B216","v":0},{"$f":"C216","v":0},"CEL/TEL :"]
["l NO MIEMBRO",{"$f":"+IF(E224=0,0,B216)","v":0},{"$f":"+IF(E224=0,0,C216)","v":0},"EMAIL:"]
["l NO MIEMBRO",{"$f":"B216","v":0},{"$f":"C216","v":0},"ESTADO CIVIL:"]
["l NO MIEMBRO",{"$f":"IF($E225=\"CASADO/A\",B216,0)","v":0},{"$f":"IF($E225=\"CASADO/A\",C216,0)","v":0},{"$f":"IF(E225=\"CASADO/A\",\"APELLIDO/S CÓNYUGE:\",\"\")","v":""}]
["l NO MIEMBRO",{"$f":"IF($E225=\"CASADO/A\",B216,0)","v":0},{"$f":"IF($E225=\"CASADO/A\",C216,0)","v":0},{"$f":"IF(E225=\"CASADO/A\",\"NOMBRE/S CÓNYUGE:\",\"\")","v":""}]
["l NO MIEMBRO",{"$f":"IF($E225=\"CASADO/A\",B216,0)","v":0},{"$f":"IF($E225=\"CASADO/A\",C216,0)","v":0},{"$f":"IF(E225=\"CASADO/A\",\"DOC. IDENTIDAD (cónyuge) –sin puntos ni barras-:\",\"\")","v":""}]
["i ORG. REP. LEGAL/ ADM.",{"$f":"IF(E229=0,0,B216)","v":0},{"$f":"IF(E229=0,0,C216)","v":0},"NOMBRE CARGO REP. LEGAL/ ADMINISTRACIÓN QUE OCUPA:"]
["j ORG. FISCALIZ.",{"$f":"IF(OR(E230=0,E230=\"PRESCINDE ART. 9 ACTO CONSTITUIVO\"),0,B216)","v":0},{"$f":"IF(OR(F230=0,E230=\"PRESCINDE ART.9 ACTO CONSTITUIVO\"),0,C216)","v":0},"NOMBRE CARGO FISCALIZACIÓN QUE OCUPA:"]
["l NO MIEMBRO",{"$f":"IF(E231=0,0,B216)","v":0},{"$f":"IF(E231=0,0,C216)","v":0},"NOTA/OBSERVACIÓN -en mayúscula-:"]
["l NO MIEMBRO",null,null,"DOC. IDENTIDAD –sin puntos-:"]
["l NO MIEMBRO",{"$f":"B232","v":0},{"$f":"C232","v":0},"CUIT/CUIL –sin puntos ni barras-:"]
["l NO MIEMBRO",{"$f":"B232","v":0},{"$f":"C232","v":0},"FECHA DE NACIMIENTO –dd/mm/aa-:"]
["l NO MIEMBRO",{"$f":"B232","v":0},{"$f":"C232","v":0},"LUGAR DE NACIMIENTO:"]
["l NO MIEMBRO",{"$f":"B232","v":0},{"$f":"C232","v":0},"NACIONALIDAD:"]
["l NO MIEMBRO",{"$f":"B232","v":0},{"$f":"C232","v":0},"PROFESIÓN/OFICIO:"]
["l NO MIEMBRO",{"$f":"B232","v":0},{"$f":"C232","v":0},"DOMICILIO REAL:"]
["l NO MIEMBRO",{"$f":"B232","v":0},{"$f":"C232","v":0},"CEL/TEL :"]
["l NO MIEMBRO",{"$f":"+IF(E240=0,0,B232)","v":0},{"$f":"+IF(E240=0,0,C232)","v":0},"EMAIL:"]
["l NO MIEMBRO",{"$f":"B232","v":0},{"$f":"C232","v":0},"ESTADO CIVIL:"]
["l NO MIEMBRO",{"$f":"IF($E241=\"CASADO/A\",B232,0)","v":0},{"$f":"IF($E241=\"CASADO/A\",C232,0)","v":0},{"$f":"IF(E241=\"CASADO/A\",\"APELLIDO/S CÓNYUGE:\",\"\")","v":""}]
["l NO MIEMBRO",{"$f":"IF($E241=\"CASADO/A\",B232,0)","v":0},{"$f":"IF($E241=\"CASADO/A\",C232,0)","v":0},{"$f":"IF(E241=\"CASADO/A\",\"NOMBRE/S CÓNYUGE:\",\"\")","v":""}]
["l NO MIEMBRO",{"$f":"IF($E241=\"CASADO/A\",B232,0)","v":0},{"$f":"IF($E241=\"CASADO/A\",C232,0)","v":0},{"$f":"IF(E241=\"CASADO/A\",\"DOC. IDENTIDAD (cónyuge) –sin puntos ni barras-:\",\"\")","v":""}]
["i ORG. REP. LEGAL/ ADM.",{"$f":"IF(E245=0,0,B232)","v":0},{"$f":"IF(E245=0,0,C232)","v":0},"NOMBRE CARGO REP. LEGAL/ ADMINISTRACIÓN QUE OCUPA:"]
["j ORG. FISCALIZ.",{"$f":"IF(OR(E246=0,E246=\"PRESCINDE ART. 9 ACTO CONSTITUIVO\"),0,B232)","v":0},{"$f":"IF(OR(F246=0,E246=\"PRESCINDE ART.9 ACTO CONSTITUIVO\"),0,C232)","v":0},"NOMBRE CARGO FISCALIZACIÓN QUE OCUPA:"]
["l NO MIEMBRO",{"$f":"IF(E247=0,0,B232)","v":0},{"$f":"IF(E247=0,0,C232)","v":0},"NOTA/OBSERVACIÓN -en mayúscula-:"]

{"sheet":"IMPRIMIR","index":4,"n_rows":642,"n_cols":6,"rows_kept":642,"cut":false,"hidden":false,"merged":[[4,5,5,5],[0,0,0,2],[2,3,2,4],[1,0,1,4],[2,0,2,2],[0,3,0,4]]}
[{"$f":"+'DATOS UT'!A1","v":"DATOS UNIÓN TRANSITORIA - act 2018/10"},null,null,"HOJA (FOJA) Nº: …………….."]
["Registro Público de Comercio"]
["NOMBRE DE LA UNIÓN TRANSITORIA:",null,null,{"$f":"+'DATOS UT'!D4:E4","v":0}]
[null,"FECHA:",{"$f":"+'DATOS UT'!D5","v":"00:00:00"}]
["REFER.","VINCULADOS","VINCULADOS","DATOS",null,"FILA Nº"]
[null,null,null,"CONCEPTO","COMPLETAR -EN MAYUSCULA -"]
[{"$f":"+'DATOS UT'!A18","v":"aa GESTOR"},{"$f":"+'DATOS UT'!B18","v":0},{"$f":"+'DATOS UT'!C18","v":0},{"$f":"+'DATOS UT'!D18","v":"TRAMITE QUE SE INICIA:"},{"$f":"IF('DATOS UT'!E18=\"ELEGIR\",\"INCOMPLETO RECHAZAR\",'DATOS UT'!E18)","v":"INCOMPLETO RECHAZAR"},1]
[{"$f":"+'DATOS UT'!A19","v":"ab GESTOR"},{"$f":"+'DATOS UT'!B19","v":0},{"$f":"+'DATOS UT'!C19","v":0},{"$f":"+'DATOS UT'!D19","v":"DOMICILIO PROCESAL CONSTITUIDO -art.40 CPCC-:"},{"$f":"IF('DATOS UT'!E19>0,'DATOS UT'!E19,\"INCOMPLETO RECHAZAR\")","v":"INCOMPLETO RECHAZAR"},2]
[{"$f":"+'DATOS UT'!A20","v":"ac GESTOR"},{"$f":"+'DATOS UT'!B20","v":0},{"$f":"+'DATOS UT'!C20","v":0},{"$f":"+'DATOS UT'!D20","v":"CARÁCTER DEL GESTIONANTE:"},{"$f":"IF('DATOS UT'!E20>0,'DATOS UT'!E20,\"INCOMPLETO RECHAZAR\")","v":"INCOMPLETO RECHAZAR"},3]
[{"$f":"+'DATOS UT'!A21","v":"ad GESTOR"},{"$f":"+'DATOS UT'!B21","v":0},{"$f":"+'DATOS UT'!C21","v":0},{"$f":"+'DATOS UT'!D21","v":"LETRADO/A/S PATROCINANTE/S:"},{"$f":"IF('DATOS UT'!E21>0,'DATOS UT'!E21,\"INCOMPLETO RECHAZAR\")","v":"INCOMPLETO RECHAZAR"},4]
[{"$f":"+'DATOS UT'!A22","v":"ae GESTOR"},{"$f":"+'DATOS UT'!B22","v":0},{"$f":"+'DATOS UT'!C22","v":0},{"$f":"+'DATOS UT'!D22","v":"DOC. IDENTIDAD –sin puntos-:"},{"$f":"IF('DATOS UT'!E22>0,'DATOS UT'!E22,\"INCOMPLETO RECHAZAR\")","v":"INCOMPLETO RECHAZAR"},5]
[{"$f":"+'DATOS UT'!A23","v":"af GESTOR"},{"$f":"+'DATOS UT'!B23","v":0},{"$f":"+'DATOS UT'!C23","v":0},{"$f":"+'DATOS UT'!D23","v":"DOMICILIO REAL -indicar Ciudad/Pcia./País"},{"$f":"IF('DATOS UT'!E23>0,'DATOS UT'!E23,\"INCOMPLETO RECHAZAR\")","v":"INCOMPLETO RECHAZAR"},6]
[{"$f":"+'DATOS UT'!A24","v":"ag GESTOR"},{"$f":"+'DATOS UT'!B24","v":0},{"$f":"+'DATOS UT'!C24","v":0},{"$f":"+'DATOS UT'!D24","v":"CEL/TEL -c/código de área, sin puntos o barras-:"},{"$f":"IF('DATOS UT'!E24>0,'DATOS UT'!E24,\"INCOMPLETO RECHAZAR\")","v":"INCOMPLETO RECHAZAR"},7]
[{"$f":"+'DATOS UT'!A25","v":"ah GESTOR"},{"$f":"+'DATOS UT'!B25","v":0},{"$f":"+'DATOS UT'!C25","v":0},{"$f":"+'DATOS UT'!D25","v":"EMAIL -OBLIGATORIO-:"},{"$f":"IF('DATOS UT'!E25>0,'DATOS UT'!E25,\"INCOMPLETO RECHAZAR\")","v":"INCOMPLETO RECHAZAR"},8]
[{"$f":"+'DATOS UT'!A36","v":"ba UNIÓN TRANSITORIA"},{"$f":"UPPER('DATOS UT'!B36)","v":"0"},{"$f":"UPPER('DATOS UT'!C36)","v":"0"},{"$f":"+'DATOS UT'!D36","v":"CEL/TEL (de administración) -en su caso indicar que no posee-:"},{"$f":"IF('DATOS UT'!E36>0,'DATOS UT'!E36,\"INCOMPLETO RECHAZAR\")","v":"INCOMPLETO RECHAZAR"},9]
[{"$f":"+'DATOS UT'!A37","v":"ba UNIÓN TRANSITORIA"},{"$f":"UPPER('DATOS UT'!B37)","v":"0"},{"$f":"UPPER('DATOS UT'!C37)","v":"0"},{"$f":"+'DATOS UT'!D37","v":"EMAIL (de administración)  -en su caso indicar que no posee-:"},{"$f":"IF('DATOS UT'!E37>0,'DATOS UT'!E37,\"INCOMPLETO RECHAZAR\")","v":"INCOMPLETO RECHAZAR"},10]
[{"$f":"+'DATOS UT'!A30","v":"ba UNIÓN TRANSITORIA"},{"$f":"UPPER('DATOS UT'!B30)","v":"0"},{"$f":"UPPER('DATOS UT'!C30)","v":"0"},{"$f":"+'DATOS UT'!D30","v":"DIRECCION domicilio legal:"},{"$f":"IF('DATOS UT'!E30>0,'DATOS UT'!E30,\"INCOMPLETO RECHAZAR\")","v":"INCOMPLETO RECHAZAR"},11]
[{"$f":"+'DATOS UT'!A31","v":"ba UNIÓN TRANSITORIA"},{"$f":"UPPER('DATOS UT'!B31)","v":"0"},{"$f":"UPPER('DATOS UT'!C31)","v":"0"},{"$f":"+'DATOS UT'!D31","v":"CUIT –sin puntos ni barras-:"},{"$f":"IF('DATOS UT'!E31>0,'DATOS UT'!E31,\"INCOMPLETO RECHAZAR\")","v":"INCOMPLETO RECHAZAR"},12]
[{"$f":"+MIEMBROS!A23","v":"c MIEMBRO PH"},{"$f":"+MIEMBROS!B23","v":0},{"$f":"+MIEMBROS!C23","v":0},{"$f":"+MIEMBROS!D23","v":"CEL/TEL :"},{"$f":"IF(MIEMBROS!E23>0,MIEMBROS!E23,\"INCOMPLETO RECHAZAR\")","v":"INCOMPLETO RECHAZAR"},14]
[{"$f":"+MIEMBROS!A17","v":"c MIEMBRO PH"},{"$f":"+MIEMBROS!B17","v":0},{"$f":"+MIEMBROS!C17","v":0},{"$f":"+MIEMBROS!D17","v":"CUIT/CUIL –sin puntos ni barras-:"},{"$f":"IF(MIEMBROS!E17>0,MIEMBROS!E17,\"INCOMPLETO RECHAZAR\")","v":"INCOMPLETO RECHAZAR"},15]
[{"$f":"+MIEMBROS!A28","v":"c MIEMBRO PH"},{"$f":"+MIEMBROS!B28","v":0},{"$f":"+MIEMBROS!C28","v":0},{"$f":"+MIEMBROS!D28","v":""},{"$f":"IF(MIEMBROS!E28>0,MIEMBROS!E28,\"INCOMPLETO RECHAZAR\")","v":"INCOMPLETO RECHAZAR"},16]
[{"$f":"+MIEMBROS!A16","v":"c MIEMBRO PH"},{"$f":"+MIEMBROS!B16","v":0},{"$f":"+MIEMBROS!C16","v":0},{"$f":"+MIEMBROS!D16","v":"DOC. IDENTIDAD –sin puntos-:"},{"$f":"IF(MIEMBROS!E16>0,MIEMBROS!E16,\"INCOMPLETO RECHAZAR\")","v":"INCOMPLETO RECHAZAR"},17]
[{"$f":"+MIEMBROS!A22","v":"c MIEMBRO PH"},{"$f":"+MIEMBROS!B22","v":0},{"$f":"+MIEMBROS!C22","v":0},{"$f":"+MIEMBROS!D22","v":"DOMICILIO REAL:"},{"$f":"IF(MIEMBROS!E22>0,MIEMBROS!E22,\"INCOMPLETO RECHAZAR\")","v":"INCOMPLETO RECHAZAR"},18]
[{"$f":"+MIEMBROS!A24","v":"c MIEMBRO PH"},{"$f":"+MIEMBROS!B24","v":0},{"$f":"+MIEMBROS!C24","v":0},{"$f":"+MIEMBROS!D24","v":"EMAIL:"},{"$f":"IF(MIEMBROS!E24>0,MIEMBROS!E24,\"INCOMPLETO RECHAZAR\")","v":"INCOMPLETO RECHAZAR"},19]
[{"$f":"+MIEMBROS!A25","v":"c MIEMBRO PH"},{"$f":"+MIEMBROS!B25","v":0},{"$f":"+MIEMBROS!C25","v":0},{"$f":"+MIEMBROS!D25","v":"ESTADO CIVIL:"},{"$f":"IF(MIEMBROS!E25>0,MIEMBROS!E25,\"INCOMPLETO RECHAZAR\")","v":"INCOMPLETO RECHAZAR"},20]
[{"$f":"+MIEMBROS!A18","v":"c MIEMBRO PH"},{"$f":"+MIEMBROS!B18","v":0},{"$f":"+MIEMBROS!C18","v":0},{"$f":"+MIEMBROS!D18","v":"FECHA DE NACIMIENTO –dd/mm/aa-:"},{"$f":"IF(MIEMBROS!E18>0,MIEMBROS!E18,\"INCOMPLETO RECHAZAR\")","v":"INCOMPLETO RECHAZAR"},21]
[{"$f":"+MIEMBROS!A19","v":"c MIEMBRO PH"},{"$f":"+MIEMBROS!B19","v":0},{"$f":"+MIEMBROS!C19","v":0},{"$f":"+MIEMBROS!D19","v":"LUGAR DE NACIMIENTO:"},{"$f":"IF(MIEMBROS!E19>0,MIEMBROS!E19,\"INCOMPLETO RECHAZAR\")","v":"INCOMPLETO RECHAZAR"},22]
[{"$f":"+MIEMBROS!A20","v":"c MIEMBRO PH"},{"$f":"+MIEMBROS!B20","v":0},{"$f":"+MIEMBROS!C20","v":0},{"$f":"+MIEMBROS!D20","v":"NACIONALIDAD:"},{"$f":"IF(MIEMBROS!E20>0,MIEMBROS!E20,\"INCOMPLETO RECHAZAR\")","v":"INCOMPLETO RECHAZAR"},23]
[{"$f":"+MIEMBROS!A27","v":"c MIEMBRO PH"},{"$f":"+MIEMBROS!B27","v":0},{"$f":"+MIEMBROS!C27","v":0},{"$f":"+MIEMBROS!D27","v":""},{"$f":"IF(MIEMBROS!E27>0,MIEMBROS!E27,\"INCOMPLETO RECHAZAR\")","v":"INCOMPLETO RECHAZAR"},24]
[{"$f":"+MIEMBROS!A33","v":"c MIEMBRO PH"},{"$f":"+MIEMBROS!B33","v":0},{"$f":"+MIEMBROS!C33","v":0},{"$f":"+MIEMBROS!D33","v":"NOTA/OBSERVACIÓN -en mayúscula-:"},{"$f":"IF(MIEMBROS!E33>0,MIEMBROS!E33,\"INCOMPLETO RECHAZAR\")","v":"INCOMPLETO RECHAZAR"},25]
[{"$f":"+MIEMBROS!A21","v":"c MIEMBRO PH"},{"$f":"+MIEMBROS!B21","v":0},{"$f":"+MIEMBROS!C21","v":0},{"$f":"+MIEMBROS!D21","v":"PROFESIÓN/OFICIO:"},{"$f":"IF(MIEMBROS!E21>0,MIEMBROS!E21,\"INCOMPLETO RECHAZAR\")","v":"INCOMPLETO RECHAZAR"},26]
[{"$f":"+MIEMBROS!A44","v":"c MIEMBRO PH"},{"$f":"+MIEMBROS!B44","v":0},{"$f":"+MIEMBROS!C44","v":0},{"$f":"+MIEMBROS!D44","v":""},{"$f":"IF(MIEMBROS!E44>0,MIEMBROS!E44,\"INCOMPLETO RECHAZAR\")","v":"INCOMPLETO RECHAZAR"},27]
[{"$f":"+MIEMBROS!A41","v":"c MIEMBRO PH"},{"$f":"+MIEMBROS!B41","v":0},{"$f":"+MIEMBROS!C41","v":0},{"$f":"+MIEMBROS!D41","v":"CEL/TEL :"},{"$f":"IF(MIEMBROS!E41>0,MIEMBROS!E41,\"INCOMPLETO RECHAZAR\")","v":"INCOMPLETO RECHAZAR"},28]
[{"$f":"+MIEMBROS!A35","v":"c MIEMBRO PH"},{"$f":"+MIEMBROS!B35","v":0},{"$f":"+MIEMBROS!C35","v":0},{"$f":"+MIEMBROS!D35","v":"CUIT/CUIL –sin puntos ni barras-:"},{"$f":"IF(MIEMBROS!E35>0,MIEMBROS!E35,\"INCOMPLETO RECHAZAR\")","v":"INCOMPLETO RECHAZAR"},29]
[{"$f":"+MIEMBROS!A46","v":"c MIEMBRO PH"},{"$f":"+MIEMBROS!B46","v":0},{"$f":"+MIEMBROS!C46","v":0},{"$f":"+MIEMBROS!D46","v":""},{"$f":"IF(MIEMBROS!E46>0,MIEMBROS!E46,\"INCOMPLETO RECHAZAR\")","v":"INCOMPLETO RECHAZAR"},30]
[{"$f":"+MIEMBROS!A34","v":"c MIEMBRO PH"},{"$f":"+MIEMBROS!B34","v":0},{"$f":"+MIEMBROS!C34","v":0},{"$f":"+MIEMBROS!D34","v":"DOC. IDENTIDAD –sin puntos-:"},{"$f":"IF(MIEMBROS!E34>0,MIEMBROS!E34,\"INCOMPLETO RECHAZAR\")","v":"INCOMPLETO RECHAZAR"},31]
[{"$f":"+MIEMBROS!A40","v":"c MIEMBRO PH"},{"$f":"+MIEMBROS!B40","v":0},{"$f":"+MIEMBROS!C40","v":0},{"$f":"+MIEMBROS!D40","v":"DOMICILIO REAL:"},{"$f":"IF(MIEMBROS!E40>0,MIEMBROS!E40,\"INCOMPLETO RECHAZAR\")","v":"INCOMPLETO RECHAZAR"},32]
[{"$f":"+MIEMBROS!A42","v":"c MIEMBRO PH"},{"$f":"+MIEMBROS!B42","v":0},{"$f":"+MIEMBROS!C42","v":0},{"$f":"+MIEMBROS!D42","v":"EMAIL:"},{"$f":"IF(MIEMBROS!E42>0,MIEMBROS!E42,\"INCOMPLETO RECHAZAR\")","v":"INCOMPLETO RECHAZAR"},33]
[{"$f":"+MIEMBROS!A43","v":"c MIEMBRO PH"},{"$f":"+MIEMBROS!B43","v":0},{"$f":"+MIEMBROS!C43","v":0},{"$f":"+MIEMBROS!D43","v":"ESTADO CIVIL:"},{"$f":"IF(MIEMBROS!E43>0,MIEMBROS!E43,\"INCOMPLETO RECHAZAR\")","v":"INCOMPLETO RECHAZAR"},34]
[{"$f":"+MIEMBROS!A36","v":"c MIEMBRO PH"},{"$f":"+MIEMBROS!B36","v":0},{"$f":"+MIEMBROS!C36","v":0},{"$f":"+MIEMBROS!D36","v":"FECHA DE NACIMIENTO –dd/mm/aa-:"},{"$f":"IF(MIEMBROS!E36>0,MIEMBROS!E36,\"INCOMPLETO RECHAZAR\")","v":"INCOMPLETO RECHAZAR"},35]
[{"$f":"+MIEMBROS!A37","v":"c MIEMBRO PH"},{"$f":"+MIEMBROS!B37","v":0},{"$f":"+MIEMBROS!C37","v":0},{"$f":"+MIEMBROS!D37","v":"LUGAR DE NACIMIENTO:"},{"$f":"IF(MIEMBROS!E37>0,MIEMBROS!E37,\"INCOMPLETO RECHAZAR\")","v":"INCOMPLETO RECHAZAR"},36]
[{"$f":"+MIEMBROS!A38","v":"c MIEMBRO PH"},{"$f":"+MIEMBROS!B38","v":0},{"$f":"+MIEMBROS!C38","v":0},{"$f":"+MIEMBROS!D38","v":"NACIONALIDAD:"},{"$f":"IF(MIEMBROS!E38>0,MIEMBROS!E38,\"INCOMPLETO RECHAZAR\")","v":"INCOMPLETO RECHAZAR"},37]
[{"$f":"+MIEMBROS!A45","v":"c MIEMBRO PH"},{"$f":"+MIEMBROS!B45","v":0},{"$f":"+MIEMBROS!C45","v":0},{"$f":"+MIEMBROS!D45","v":""},{"$f":"IF(MIEMBROS!E45>0,MIEMBROS!E45,\"INCOMPLETO RECHAZAR\")","v":"INCOMPLETO RECHAZAR"},38]
[{"$f":"+MIEMBROS!A55","v":"c MIEMBRO PH"},{"$f":"+MIEMBROS!B55","v":0},{"$f":"+MIEMBROS!C55","v":0},{"$f":"+MIEMBROS!D55","v":"LUGAR DE NACIMIENTO:"},{"$f":"IF(MIEMBROS!E55>0,MIEMBROS!E55,\"INCOMPLETO RECHAZAR\")","v":"INCOMPLETO RECHAZAR"},39]
[{"$f":"+MIEMBROS!A39","v":"c MIEMBRO PH"},{"$f":"+MIEMBROS!B39","v":0},{"$f":"+MIEMBROS!C39","v":0},{"$f":"+MIEMBROS!D39","v":"PROFESIÓN/OFICIO:"},{"$f":"IF(MIEMBROS!E39>0,MIEMBROS!E39,\"INCOMPLETO RECHAZAR\")","v":"INCOMPLETO RECHAZAR"},40]
[{"$f":"+MIEMBROS!A66","v":"f PARTICIPACION"},{"$f":"+MIEMBROS!B66","v":0},{"$f":"+MIEMBROS!C66","v":0},{"$f":"+MIEMBROS!D66","v":"PARTICIPACIÓN S/FONDO COMÚN OPERATIVO (%):"},{"$f":"IF(MIEMBROS!E66>0,MIEMBROS!E66,\"INCOMPLETO RECHAZAR\")","v":{"$error":"#DIV/0!"}},41]
[{"$f":"+MIEMBROS!A63","v":"c MIEMBRO PH"},{"$f":"+MIEMBROS!B63","v":0},{"$f":"+MIEMBROS!C63","v":0},{"$f":"+MIEMBROS!D63","v":""},{"$f":"IF(MIEMBROS!E63>0,MIEMBROS!E63,\"INCOMPLETO RECHAZAR\")","v":"INCOMPLETO RECHAZAR"},42]
[{"$f":"+MIEMBROS!A57","v":"c MIEMBRO PH"},{"$f":"+MIEMBROS!B57","v":0},{"$f":"+MIEMBROS!C57","v":0},{"$f":"+MIEMBROS!D57","v":"PROFESIÓN/OFICIO:"},{"$f":"IF(MIEMBROS!E57>0,MIEMBROS!E57,\"INCOMPLETO RECHAZAR\")","v":"INCOMPLETO RECHAZAR"},43]
[{"$f":"+MIEMBROS!A68","v":"j ORG. FISCALIZ."},{"$f":"+MIEMBROS!B68","v":0},{"$f":"+MIEMBROS!C68","v":0},{"$f":"+MIEMBROS!D68","v":"NOMBRE CARGO FISCALIZACIÓN QUE OCUPA:"},{"$f":"IF(MIEMBROS!E68>0,MIEMBROS!E68,\"INCOMPLETO RECHAZAR\")","v":"INCOMPLETO RECHAZAR"},44]
[{"$f":"+MIEMBROS!A56","v":"c MIEMBRO PH"},{"$f":"+MIEMBROS!B56","v":0},{"$f":"+MIEMBROS!C56","v":0},{"$f":"+MIEMBROS!D56","v":"NACIONALIDAD:"},{"$f":"IF(MIEMBROS!E56>0,MIEMBROS!E56,\"INCOMPLETO RECHAZAR\")","v":"INCOMPLETO RECHAZAR"},45]
[{"$f":"+MIEMBROS!A62","v":"c MIEMBRO PH"},{"$f":"+MIEMBROS!B62","v":0},{"$f":"+MIEMBROS!C62","v":0},{"$f":"+MIEMBROS!D62","v":""},{"$f":"IF(MIEMBROS!E62>0,MIEMBROS!E62,\"INCOMPLETO RECHAZAR\")","v":"INCOMPLETO RECHAZAR"},46]
[{"$f":"+MIEMBROS!A64","v":"c MIEMBRO PH"},{"$f":"+MIEMBROS!B64","v":0},{"$f":"+MIEMBROS!C64","v":0},{"$f":"+MIEMBROS!D64","v":""},{"$f":"IF(MIEMBROS!E64>0,MIEMBROS!E64,\"INCOMPLETO RECHAZAR\")","v":"INCOMPLETO RECHAZAR"},47]
[{"$f":"+MIEMBROS!A65","v":"g CONTRIB."},{"$f":"+MIEMBROS!B65","v":0},{"$f":"+MIEMBROS!C65","v":0},{"$f":"+MIEMBROS!D65","v":"CONTRIBUCIÓN -EN PESOS U OTRA MONEDA-:"},{"$f":"IF(MIEMBROS!E65>0,MIEMBROS!E65,\"INCOMPLETO RECHAZAR\")","v":"INCOMPLETO RECHAZAR"},48]
[{"$f":"+MIEMBROS!A58","v":"c MIEMBRO PH"},{"$f":"+MIEMBROS!B58","v":0},{"$f":"+MIEMBROS!C58","v":0},{"$f":"+MIEMBROS!D58","v":"DOMICILIO REAL:"},{"$f":"IF(MIEMBROS!E58>0,MIEMBROS!E58,\"INCOMPLETO RECHAZAR\")","v":"INCOMPLETO RECHAZAR"},49]
[{"$f":"+MIEMBROS!A59","v":"c MIEMBRO PH"},{"$f":"+MIEMBROS!B59","v":0},{"$f":"+MIEMBROS!C59","v":0},{"$f":"+MIEMBROS!D59","v":"CEL/TEL :"},{"$f":"IF(MIEMBROS!E59>0,MIEMBROS!E59,\"INCOMPLETO RECHAZAR\")","v":"INCOMPLETO RECHAZAR"},50]
[{"$f":"+MIEMBROS!A60","v":"c MIEMBRO PH"},{"$f":"+MIEMBROS!B60","v":0},{"$f":"+MIEMBROS!C60","v":0},{"$f":"+MIEMBROS!D60","v":"EMAIL:"},{"$f":"IF(MIEMBROS!E60>0,MIEMBROS!E60,\"INCOMPLETO RECHAZAR\")","v":"INCOMPLETO RECHAZAR"},51]
[{"$f":"+MIEMBROS!A67","v":"i ORG. REP. LEGAL/ ADM."},{"$f":"+MIEMBROS!B67","v":0},{"$f":"+MIEMBROS!C67","v":0},{"$f":"+MIEMBROS!D67","v":"NOMBRE CARGO REP. LEGAL/ ADMINISTRACIÓN QUE OCUPA:"},{"$f":"IF(MIEMBROS!E67>0,MIEMBROS!E67,\"INCOMPLETO RECHAZAR\")","v":"INCOMPLETO RECHAZAR"},52]
[{"$f":"+MIEMBROS!A77","v":"c MIEMBRO PH"},{"$f":"+MIEMBROS!B77","v":0},{"$f":"+MIEMBROS!C77","v":0},{"$f":"+MIEMBROS!D77","v":"CEL/TEL :"},{"$f":"IF(MIEMBROS!E77>0,MIEMBROS!E77,\"INCOMPLETO RECHAZAR\")","v":"INCOMPLETO RECHAZAR"},53]
[{"$f":"+MIEMBROS!A61","v":"c MIEMBRO PH"},{"$f":"+MIEMBROS!B61","v":0},{"$f":"+MIEMBROS!C61","v":0},{"$f":"+MIEMBROS!D61","v":"ESTADO CIVIL:"},{"$f":"IF(MIEMBROS!E61>0,MIEMBROS!E61,\"INCOMPLETO RECHAZAR\")","v":"INCOMPLETO RECHAZAR"},54]
[{"$f":"+MIEMBROS!A88","v":"c MIEMBRO PH"},{"$f":"+MIEMBROS!B88","v":0},{"$f":"+MIEMBROS!C88","v":0},{"$f":"+MIEMBROS!D88","v":"DOC. IDENTIDAD –sin puntos-:"},{"$f":"IF(MIEMBROS!E88>0,MIEMBROS!E88,\"INCOMPLETO RECHAZAR\")","v":"INCOMPLETO RECHAZAR"},55]
[{"$f":"+MIEMBROS!A85","v":"i ORG. REP. LEGAL/ ADM."},{"$f":"+MIEMBROS!B85","v":0},{"$f":"+MIEMBROS!C85","v":0},{"$f":"+MIEMBROS!D85","v":"NOMBRE CARGO REP. LEGAL/ ADMINISTRACIÓN QUE OCUPA:"},{"$f":"IF(MIEMBROS!E85>0,MIEMBROS!E85,\"INCOMPLETO RECHAZAR\")","v":"INCOMPLETO RECHAZAR"},56]
[{"$f":"+MIEMBROS!A79","v":"c MIEMBRO PH"},{"$f":"+MIEMBROS!B79","v":0},{"$f":"+MIEMBROS!C79","v":0},{"$f":"+MIEMBROS!D79","v":"ESTADO CIVIL:"},{"$f":"IF(MIEMBROS!E79>0,MIEMBROS!E79,\"INCOMPLETO RECHAZAR\")","v":"INCOMPLETO RECHAZAR"},57]
[{"$f":"+MIEMBROS!A90","v":"c MIEMBRO PH"},{"$f":"+MIEMBROS!B90","v":0},{"$f":"+MIEMBROS!C90","v":0},{"$f":"+MIEMBROS!D90","v":"FECHA DE NACIMIENTO –dd/mm/aa-:"},{"$f":"IF(MIEMBROS!E90>0,MIEMBROS!E90,\"INCOMPLETO RECHAZAR\")","v":"INCOMPLETO RECHAZAR"},58]
[{"$f":"+MIEMBROS!A78","v":"c MIEMBRO PH"},{"$f":"+MIEMBROS!B78","v":0},{"$f":"+MIEMBROS!C78","v":0},{"$f":"+MIEMBROS!D78","v":"EMAIL:"},{"$f":"IF(MIEMBROS!E78>0,MIEMBROS!E78,\"INCOMPLETO RECHAZAR\")","v":"INCOMPLETO RECHAZAR"},59]
[{"$f":"+MIEMBROS!A84","v":"f PARTICIPACION"},{"$f":"+MIEMBROS!B84","v":0},{"$f":"+MIEMBROS!C84","v":0},{"$f":"+MIEMBROS!D84","v":"PARTICIPACIÓN S/FONDO COMÚN OPERATIVO (%):"},{"$f":"IF(MIEMBROS!E84>0,MIEMBROS!E84,\"INCOMPLETO RECHAZAR\")","v":{"$error":"#DIV/0!"}},60]
[{"$f":"+MIEMBROS!A86","v":"j ORG. FISCALIZ."},{"$f":"+MIEMBROS!B86","v":0},{"$f":"+MIEMBROS!C86","v":0},{"$f":"+MIEMBROS!D86","v":"NOMBRE CARGO FISCALIZACIÓN QUE OCUPA:"},{"$f":"IF(MIEMBROS!E86>0,MIEMBROS!E86,\"INCOMPLETO RECHAZAR\")","v":"INCOMPLETO RECHAZAR"},61]
[{"$f":"+MIEMBROS!A87","v":"c MIEMBRO PH"},{"$f":"+MIEMBROS!B87","v":0},{"$f":"+MIEMBROS!C87","v":0},{"$f":"+MIEMBROS!D87","v":"NOTA/OBSERVACIÓN -en mayúscula-:"},{"$f":"IF(MIEMBROS!E87>0,MIEMBROS!E87,\"INCOMPLETO RECHAZAR\")","v":"INCOMPLETO RECHAZAR"},62]
[{"$f":"+MIEMBROS!A80","v":"c MIEMBRO PH"},{"$f":"+MIEMBROS!B80","v":0},{"$f":"+MIEMBROS!C80","v":0},{"$f":"+MIEMBROS!D80","v":""},{"$f":"IF(MIEMBROS!E80>0,MIEMBROS!E80,\"INCOMPLETO RECHAZAR\")","v":"INCOMPLETO RECHAZAR"},63]
[{"$f":"+MIEMBROS!A81","v":"c MIEMBRO PH"},{"$f":"+MIEMBROS!B81","v":0},{"$f":"+MIEMBROS!C81","v":0},{"$f":"+MIEMBROS!D81","v":""},{"$f":"IF(MIEMBROS!E81>0,MIEMBROS!E81,\"INCOMPLETO RECHAZAR\")","v":"INCOMPLETO RECHAZAR"},64]
[{"$f":"+MIEMBROS!A82","v":"c MIEMBRO PH"},{"$f":"+MIEMBROS!B82","v":0},{"$f":"+MIEMBROS!C82","v":0},{"$f":"+MIEMBROS!D82","v":""},{"$f":"IF(MIEMBROS!E82>0,MIEMBROS!E82,\"INCOMPLETO RECHAZAR\")","v":"INCOMPLETO RECHAZAR"},65]
[{"$f":"+MIEMBROS!A89","v":"c MIEMBRO PH"},{"$f":"+MIEMBROS!B89","v":0},{"$f":"+MIEMBROS!C89","v":0},{"$f":"+MIEMBROS!D89","v":"CUIT/CUIL –sin puntos ni barras-:"},{"$f":"IF(MIEMBROS!E89>0,MIEMBROS!E89,\"INCOMPLETO RECHAZAR\")","v":"INCOMPLETO RECHAZAR"},66]
[{"$f":"+MIEMBROS!A99","v":"c MIEMBRO PH"},{"$f":"+MIEMBROS!B99","v":0},{"$f":"+MIEMBROS!C99","v":0},{"$f":"+MIEMBROS!D99","v":""},{"$f":"IF(MIEMBROS!E99>0,MIEMBROS!E99,\"INCOMPLETO RECHAZAR\")","v":"INCOMPLETO RECHAZAR"},67]
[{"$f":"+MIEMBROS!A83","v":"g CONTRIB."},{"$f":"+MIEMBROS!B83","v":0},{"$f":"+MIEMBROS!C83","v":0},{"$f":"+MIEMBROS!D83","v":"CONTRIBUCIÓN -EN PESOS U OTRA MONEDA-:"},{"$f":"IF(MIEMBROS!E83>0,MIEMBROS!E83,\"INCOMPLETO RECHAZAR\")","v":"INCOMPLETO RECHAZAR"},68]
[{"$f":"+MIEMBROS!A110","v":"c MIEMBRO PH"},{"$f":"+MIEMBROS!B110","v":0},{"$f":"+MIEMBROS!C110","v":0},{"$f":"+MIEMBROS!D110","v":"NACIONALIDAD:"},{"$f":"IF(MIEMBROS!E110>0,MIEMBROS!E110,\"INCOMPLETO RECHAZAR\")","v":"INCOMPLETO RECHAZAR"},69]
[{"$f":"+MIEMBROS!A107","v":"c MIEMBRO PH"},{"$f":"+MIEMBROS!B107","v":0},{"$f":"+MIEMBROS!C107","v":0},{"$f":"+MIEMBROS!D107","v":"CUIT/CUIL –sin puntos ni barras-:"},{"$f":"IF(MIEMBROS!E107>0,MIEMBROS!E107,\"INCOMPLETO RECHAZAR\")","v":"INCOMPLETO RECHAZAR"},70]
[{"$f":"+MIEMBROS!A101","v":"g CONTRIB."},{"$f":"+MIEMBROS!B101","v":0},{"$f":"+MIEMBROS!C101","v":0},{"$f":"+MIEMBROS!D101","v":"CONTRIBUCIÓN -EN PESOS U OTRA MONEDA-:"},{"$f":"IF(MIEMBROS!E101>0,MIEMBROS!E101,\"INCOMPLETO RECHAZAR\")","v":"INCOMPLETO RECHAZAR"},71]
[{"$f":"+MIEMBROS!A112","v":"c MIEMBRO PH"},{"$f":"+MIEMBROS!B112","v":0},{"$f":"+MIEMBROS!C112","v":0},{"$f":"+MIEMBROS!D112","v":"DOMICILIO REAL:"},{"$f":"IF(MIEMBROS!E112>0,MIEMBROS!E112,\"INCOMPLETO RECHAZAR\")","v":"INCOMPLETO RECHAZAR"},72]
[{"$f":"+MIEMBROS!A100","v":"c MIEMBRO PH"},{"$f":"+MIEMBROS!B100","v":0},{"$f":"+MIEMBROS!C100","v":0},{"$f":"+MIEMBROS!D100","v":""},{"$f":"IF(MIEMBROS!E100>0,MIEMBROS!E100,\"INCOMPLETO RECHAZAR\")","v":"INCOMPLETO RECHAZAR"},73]
[{"$f":"+MIEMBROS!A106","v":"c MIEMBRO PH"},{"$f":"+MIEMBROS!B106","v":0},{"$f":"+MIEMBROS!C106","v":0},{"$f":"+MIEMBROS!D106","v":"DOC. IDENTIDAD –sin puntos-:"},{"$f":"IF(MIEMBROS!E106>0,MIEMBROS!E106,\"INCOMPLETO RECHAZAR\")","v":"INCOMPLETO RECHAZAR"},74]
[{"$f":"+MIEMBROS!A108","v":"c MIEMBRO PH"},{"$f":"+MIEMBROS!B108","v":0},{"$f":"+MIEMBROS!C108","v":0},{"$f":"+MIEMBROS!D108","v":"FECHA DE NACIMIENTO –dd/mm/aa-:"},{"$f":"IF(MIEMBROS!E108>0,MIEMBROS!E108,\"INCOMPLETO RECHAZAR\")","v":"INCOMPLETO RECHAZAR"},75]
[{"$f":"+MIEMBROS!A109","v":"c MIEMBRO PH"},{"$f":"+MIEMBROS!B109","v":0},{"$f":"+MIEMBROS!C109","v":0},{"$f":"+MIEMBROS!D109","v":"LUGAR DE NACIMIENTO:"},{"$f":"IF(MIEMBROS!E109>0,MIEMBROS!E109,\"INCOMPLETO RECHAZAR\")","v":"INCOMPLETO RECHAZAR"},76]
[{"$f":"+MIEMBROS!A102","v":"f PARTICIPACION"},{"$f":"+MIEMBROS!B102","v":0},{"$f":"+MIEMBROS!C102","v":0},{"$f":"+MIEMBROS!D102","v":"PARTICIPACIÓN S/FONDO COMÚN OPERATIVO (%):"},{"$f":"IF(MIEMBROS!E102>0,MIEMBROS!E102,\"INCOMPLETO RECHAZAR\")","v":{"$error":"#DIV/0!"}},77]
[{"$f":"+MIEMBROS!A103","v":"i ORG. REP. LEGAL/ ADM."},{"$f":"+MIEMBROS!B103","v":0},{"$f":"+MIEMBROS!C103","v":0},{"$f":"+MIEMBROS!D103","v":"NOMBRE CARGO REP. LEGAL/ ADMINISTRACIÓN QUE OCUPA:"},{"$f":"IF(MIEMBROS!E103>0,MIEMBROS!E103,\"INCOMPLETO RECHAZAR\")","v":"INCOMPLETO RECHAZAR"},78]
[{"$f":"+MIEMBROS!A104","v":"j ORG. FISCALIZ."},{"$f":"+MIEMBROS!B104","v":0},{"$f":"+MIEMBROS!C104","v":0},{"$f":"+MIEMBROS!D104","v":"NOMBRE CARGO FISCALIZACIÓN QUE OCUPA:"},{"$f":"IF(MIEMBROS!E104>0,MIEMBROS!E104,\"INCOMPLETO RECHAZAR\")","v":"INCOMPLETO RECHAZAR"},79]
[{"$f":"+MIEMBROS!A111","v":"c MIEMBRO PH"},{"$f":"+MIEMBROS!B111","v":0},{"$f":"+MIEMBROS!C111","v":0},{"$f":"+MIEMBROS!D111","v":"PROFESIÓN/OFICIO:"},{"$f":"IF(MIEMBROS!E111>0,MIEMBROS!E111,\"INCOMPLETO RECHAZAR\")","v":"INCOMPLETO RECHAZAR"},80]
[{"$f":"+MIEMBROS!A121","v":"i ORG. REP. LEGAL/ ADM."},{"$f":"+MIEMBROS!B121","v":0},{"$f":"+MIEMBROS!C121","v":0},{"$f":"+MIEMBROS!D121","v":"NOMBRE CARGO REP. LEGAL/ ADMINISTRACIÓN QUE OCUPA:"},{"$f":"IF(MIEMBROS!E121>0,MIEMBROS!E121,\"INCOMPLETO RECHAZAR\")","v":"INCOMPLETO RECHAZAR"},81]
[{"$f":"+MIEMBROS!A105","v":"c MIEMBRO PH"},{"$f":"+MIEMBROS!B105","v":0},{"$f":"+MIEMBROS!C105","v":0},{"$f":"+MIEMBROS!D105","v":"NOTA/OBSERVACIÓN -en mayúscula-:"},{"$f":"IF(MIEMBROS!E105>0,MIEMBROS!E105,\"INCOMPLETO RECHAZAR\")","v":"INCOMPLETO RECHAZAR"},82]
[{"$f":"+MIEMBROS!A132","v":"c MIEMBRO PH"},{"$f":"+MIEMBROS!B132","v":0},{"$f":"+MIEMBROS!C132","v":0},{"$f":"+MIEMBROS!D132","v":"EMAIL:"},{"$f":"IF(MIEMBROS!E132>0,MIEMBROS!E132,\"INCOMPLETO RECHAZAR\")","v":"INCOMPLETO RECHAZAR"},83]
[{"$f":"+MIEMBROS!A129","v":"c MIEMBRO PH"},{"$f":"+MIEMBROS!B129","v":0},{"$f":"+MIEMBROS!C129","v":0},{"$f":"+MIEMBROS!D129","v":"PROFESIÓN/OFICIO:"},{"$f":"IF(MIEMBROS!E129>0,MIEMBROS!E129,\"INCOMPLETO RECHAZAR\")","v":"INCOMPLETO RECHAZAR"},84]
[{"$f":"+MIEMBROS!A123","v":"c MIEMBRO PH"},{"$f":"+MIEMBROS!B123","v":0},{"$f":"+MIEMBROS!C123","v":0},{"$f":"+MIEMBROS!D123","v":"NOTA/OBSERVACIÓN -en mayúscula-:"},{"$f":"IF(MIEMBROS!E123>0,MIEMBROS!E123,\"INCOMPLETO RECHAZAR\")","v":"INCOMPLETO RECHAZAR"},85]
[{"$f":"+MIEMBROS!A134","v":"c MIEMBRO PH"},{"$f":"+MIEMBROS!B134","v":0},{"$f":"+MIEMBROS!C134","v":0},{"$f":"+MIEMBROS!D134","v":""},{"$f":"IF(MIEMBROS!E134>0,MIEMBROS!E134,\"INCOMPLETO RECHAZAR\")","v":"INCOMPLETO RECHAZAR"},86]
[{"$f":"+MIEMBROS!A122","v":"j ORG. FISCALIZ."},{"$f":"+MIEMBROS!B122","v":0},{"$f":"+MIEMBROS!C122","v":0},{"$f":"+MIEMBROS!D122","v":"NOMBRE CARGO FISCALIZACIÓN QUE OCUPA:"},{"$f":"IF(MIEMBROS!E122>0,MIEMBROS!E122,\"INCOMPLETO RECHAZAR\")","v":"INCOMPLETO RECHAZAR"},87]
[{"$f":"+MIEMBROS!A128","v":"c MIEMBRO PH"},{"$f":"+MIEMBROS!B128","v":0},{"$f":"+MIEMBROS!C128","v":0},{"$f":"+MIEMBROS!D128","v":"NACIONALIDAD:"},{"$f":"IF(MIEMBROS!E128>0,MIEMBROS!E128,\"INCOMPLETO RECHAZAR\")","v":"INCOMPLETO RECHAZAR"},88]
[{"$f":"+MIEMBROS!A130","v":"c MIEMBRO PH"},{"$f":"+MIEMBROS!B130","v":0},{"$f":"+MIEMBROS!C130","v":0},{"$f":"+MIEMBROS!D130","v":"DOMICILIO REAL:"},{"$f":"IF(MIEMBROS!E130>0,MIEMBROS!E130,\"INCOMPLETO RECHAZAR\")","v":"INCOMPLETO RECHAZAR"},89]
[{"$f":"+MIEMBROS!A131","v":"c MIEMBRO PH"},{"$f":"+MIEMBROS!B131","v":0},{"$f":"+MIEMBROS!C131","v":0},{"$f":"+MIEMBROS!D131","v":"CEL/TEL :"},{"$f":"IF(MIEMBROS!E131>0,MIEMBROS!E131,\"INCOMPLETO RECHAZAR\")","v":"INCOMPLETO RECHAZAR"},90]
[{"$f":"+MIEMBROS!A124","v":"c MIEMBRO PH"},{"$f":"+MIEMBROS!B124","v":0},{"$f":"+MIEMBROS!C124","v":0},{"$f":"+MIEMBROS!D124","v":"DOC. IDENTIDAD –sin puntos-:"},{"$f":"IF(MIEMBROS!E124>0,MIEMBROS!E124,\"INCOMPLETO RECHAZAR\")","v":"INCOMPLETO RECHAZAR"},91]
[{"$f":"+MIEMBROS!A125","v":"c MIEMBRO PH"},{"$f":"+MIEMBROS!B125","v":0},{"$f":"+MIEMBROS!C125","v":0},{"$f":"+MIEMBROS!D125","v":"CUIT/CUIL –sin puntos ni barras-:"},{"$f":"IF(MIEMBROS!E125>0,MIEMBROS!E125,\"INCOMPLETO RECHAZAR\")","v":"INCOMPLETO RECHAZAR"},92]
[{"$f":"+MIEMBROS!A126","v":"c MIEMBRO PH"},{"$f":"+MIEMBROS!B126","v":0},{"$f":"+MIEMBROS!C126","v":0},{"$f":"+MIEMBROS!D126","v":"FECHA DE NACIMIENTO –dd/mm/aa-:"},{"$f":"IF(MIEMBROS!E126>0,MIEMBROS!E126,\"INCOMPLETO RECHAZAR\")","v":"INCOMPLETO RECHAZAR"},93]
[{"$f":"+MIEMBROS!A133","v":"c MIEMBRO PH"},{"$f":"+MIEMBROS!B133","v":0},{"$f":"+MIEMBROS!C133","v":0},{"$f":"+MIEMBROS!D133","v":"ESTADO CIVIL:"},{"$f":"IF(MIEMBROS!E133>0,MIEMBROS!E133,\"INCOMPLETO RECHAZAR\")","v":"INCOMPLETO RECHAZAR"},94]
[{"$f":"+MIEMBROS!A143","v":"c MIEMBRO PH"},{"$f":"+MIEMBROS!B143","v":0},{"$f":"+MIEMBROS!C143","v":0},{"$f":"+MIEMBROS!D143","v":"CUIT/CUIL –sin puntos ni barras-:"},{"$f":"IF(MIEMBROS!E143>0,MIEMBROS!E143,\"INCOMPLETO RECHAZAR\")","v":"INCOMPLETO RECHAZAR"},95]
[{"$f":"+MIEMBROS!A127","v":"c MIEMBRO PH"},{"$f":"+MIEMBROS!B127","v":0},{"$f":"+MIEMBROS!C127","v":0},{"$f":"+MIEMBROS!D127","v":"LUGAR DE NACIMIENTO:"},{"$f":"IF(MIEMBROS!E127>0,MIEMBROS!E127,\"INCOMPLETO RECHAZAR\")","v":"INCOMPLETO RECHAZAR"},96]
[{"$f":"+MIEMBROS!A154","v":"c MIEMBRO PH"},{"$f":"+MIEMBROS!B154","v":0},{"$f":"+MIEMBROS!C154","v":0},{"$f":"+MIEMBROS!D154","v":""},{"$f":"IF(MIEMBROS!E154>0,MIEMBROS!E154,\"INCOMPLETO RECHAZAR\")","v":"INCOMPLETO RECHAZAR"},97]
[{"$f":"+MIEMBROS!A151","v":"c MIEMBRO PH"},{"$f":"+MIEMBROS!B151","v":0},{"$f":"+MIEMBROS!C151","v":0},{"$f":"+MIEMBROS!D151","v":"ESTADO CIVIL:"},{"$f":"IF(MIEMBROS!E151>0,MIEMBROS!E151,\"INCOMPLETO RECHAZAR\")","v":"INCOMPLETO RECHAZAR"},98]
[{"$f":"+MIEMBROS!A145","v":"c MIEMBRO PH"},{"$f":"+MIEMBROS!B145","v":0},{"$f":"+MIEMBROS!C145","v":0},{"$f":"+MIEMBROS!D145","v":"LUGAR DE NACIMIENTO:"},{"$f":"IF(MIEMBROS!E145>0,MIEMBROS!E145,\"INCOMPLETO RECHAZAR\")","v":"INCOMPLETO RECHAZAR"},99]
[{"$f":"+MIEMBROS!A156","v":"f PARTICIPACION"},{"$f":"+MIEMBROS!B156","v":0},{"$f":"+MIEMBROS!C156","v":0},{"$f":"+MIEMBROS!D156","v":"PARTICIPACIÓN S/FONDO COMÚN OPERATIVO (%):"},{"$f":"IF(MIEMBROS!E156>0,MIEMBROS!E156,\"INCOMPLETO RECHAZAR\")","v":{"$error":"#DIV/0!"}},100]
[{"$f":"+MIEMBROS!A144","v":"c MIEMBRO PH"},{"$f":"+MIEMBROS!B144","v":0},{"$f":"+MIEMBROS!C144","v":0},{"$f":"+MIEMBROS!D144","v":"FECHA DE NACIMIENTO –dd/mm/aa-:"},{"$f":"IF(MIEMBROS!E144>0,MIEMBROS!E144,\"INCOMPLETO RECHAZAR\")","v":"INCOMPLETO RECHAZAR"},101]
[{"$f":"+MIEMBROS!A150","v":"c MIEMBRO PH"},{"$f":"+MIEMBROS!B150","v":0},{"$f":"+MIEMBROS!C150","v":0},{"$f":"+MIEMBROS!D150","v":"EMAIL:"},{"$f":"IF(MIEMBROS!E150>0,MIEMBROS!E150,\"INCOMPLETO RECHAZAR\")","v":"INCOMPLETO RECHAZAR"},102]
[{"$f":"+MIEMBROS!A152","v":"c MIEMBRO PH"},{"$f":"+MIEMBROS!B152","v":0},{"$f":"+MIEMBROS!C152","v":0},{"$f":"+MIEMBROS!D152","v":""},{"$f":"IF(MIEMBROS!E152>0,MIEMBROS!E152,\"INCOMPLETO RECHAZAR\")","v":"INCOMPLETO RECHAZAR"},103]
[{"$f":"+MIEMBROS!A153","v":"c MIEMBRO PH"},{"$f":"+MIEMBROS!B153","v":0},{"$f":"+MIEMBROS!C153","v":0},{"$f":"+MIEMBROS!D153","v":""},{"$f":"IF(MIEMBROS!E153>0,MIEMBROS!E153,\"INCOMPLETO RECHAZAR\")","v":"INCOMPLETO RECHAZAR"},104]
[{"$f":"+MIEMBROS!A146","v":"c MIEMBRO PH"},{"$f":"+MIEMBROS!B146","v":0},{"$f":"+MIEMBROS!C146","v":0},{"$f":"+MIEMBROS!D146","v":"NACIONALIDAD:"},{"$f":"IF(MIEMBROS!E146>0,MIEMBROS!E146,\"INCOMPLETO RECHAZAR\")","v":"INCOMPLETO RECHAZAR"},105]
[{"$f":"+MIEMBROS!A147","v":"c MIEMBRO PH"},{"$f":"+MIEMBROS!B147","v":0},{"$f":"+MIEMBROS!C147","v":0},{"$f":"+MIEMBROS!D147","v":"PROFESIÓN/OFICIO:"},{"$f":"IF(MIEMBROS!E147>0,MIEMBROS!E147,\"INCOMPLETO RECHAZAR\")","v":"INCOMPLETO RECHAZAR"},106]
[{"$f":"+MIEMBROS!A148","v":"c MIEMBRO PH"},{"$f":"+MIEMBROS!B148","v":0},{"$f":"+MIEMBROS!C148","v":0},{"$f":"+MIEMBROS!D148","v":"DOMICILIO REAL:"},{"$f":"IF(MIEMBROS!E148>0,MIEMBROS!E148,\"INCOMPLETO RECHAZAR\")","v":"INCOMPLETO RECHAZAR"},107]
[{"$f":"+MIEMBROS!A155","v":"g CONTRIB."},{"$f":"+MIEMBROS!B155","v":0},{"$f":"+MIEMBROS!C155","v":0},{"$f":"+MIEMBROS!D155","v":"CONTRIBUCIÓN -EN PESOS U OTRA MONEDA-:"},{"$f":"IF(MIEMBROS!E155>0,MIEMBROS!E155,\"INCOMPLETO RECHAZAR\")","v":"INCOMPLETO RECHAZAR"},108]
[{"$f":"+MIEMBROS!A165","v":"c MIEMBRO PH"},{"$f":"+MIEMBROS!B165","v":0},{"$f":"+MIEMBROS!C165","v":0},{"$f":"+MIEMBROS!D165","v":"PROFESIÓN/OFICIO:"},{"$f":"IF(MIEMBROS!E165>0,MIEMBROS!E165,\"INCOMPLETO RECHAZAR\")","v":"INCOMPLETO RECHAZAR"},109]
[{"$f":"+MIEMBROS!A149","v":"c MIEMBRO PH"},{"$f":"+MIEMBROS!B149","v":0},{"$f":"+MIEMBROS!C149","v":0},{"$f":"+MIEMBROS!D149","v":"CEL/TEL :"},{"$f":"IF(MIEMBROS!E149>0,MIEMBROS!E149,\"INCOMPLETO RECHAZAR\")","v":"INCOMPLETO RECHAZAR"},110]
[{"$f":"+MIEMBROS!A176","v":"j ORG. FISCALIZ."},{"$f":"+MIEMBROS!B176","v":0},{"$f":"+MIEMBROS!C176","v":0},{"$f":"+MIEMBROS!D176","v":"NOMBRE CARGO FISCALIZACIÓN QUE OCUPA:"},{"$f":"IF(MIEMBROS!E176>0,MIEMBROS!E176,\"INCOMPLETO RECHAZAR\")","v":"INCOMPLETO RECHAZAR"},111]
[{"$f":"+MIEMBROS!A173","v":"g CONTRIB."},{"$f":"+MIEMBROS!B173","v":0},{"$f":"+MIEMBROS!C173","v":0},{"$f":"+MIEMBROS!D173","v":"CONTRIBUCIÓN -EN PESOS U OTRA MONEDA-:"},{"$f":"IF(MIEMBROS!E173>0,MIEMBROS!E173,\"INCOMPLETO RECHAZAR\")","v":"INCOMPLETO RECHAZAR"},112]
[{"$f":"+MIEMBROS!A167","v":"c MIEMBRO PH"},{"$f":"+MIEMBROS!B167","v":0},{"$f":"+MIEMBROS!C167","v":0},{"$f":"+MIEMBROS!D167","v":"CEL/TEL :"},{"$f":"IF(MIEMBROS!E167>0,MIEMBROS!E167,\"INCOMPLETO RECHAZAR\")","v":"INCOMPLETO RECHAZAR"},113]
[{"$f":"+MIEMBROS!A178","v":"c MIEMBRO PH"},{"$f":"+MIEMBROS!B178","v":0},{"$f":"+MIEMBROS!C178","v":0},{"$f":"+MIEMBROS!D178","v":"DOC. IDENTIDAD –sin puntos-:"},{"$f":"IF(MIEMBROS!E178>0,MIEMBROS!E178,\"INCOMPLETO RECHAZAR\")","v":"INCOMPLETO RECHAZAR"},114]
[{"$f":"+MIEMBROS!A166","v":"c MIEMBRO PH"},{"$f":"+MIEMBROS!B166","v":0},{"$f":"+MIEMBROS!C166","v":0},{"$f":"+MIEMBROS!D166","v":"DOMICILIO REAL:"},{"$f":"IF(MIEMBROS!E166>0,MIEMBROS!E166,\"INCOMPLETO RECHAZAR\")","v":"INCOMPLETO RECHAZAR"},115]
[{"$f":"+MIEMBROS!A172","v":"c MIEMBRO PH"},{"$f":"+MIEMBROS!B172","v":0},{"$f":"+MIEMBROS!C172","v":0},{"$f":"+MIEMBROS!D172","v":""},{"$f":"IF(MIEMBROS!E172>0,MIEMBROS!E172,\"INCOMPLETO RECHAZAR\")","v":"INCOMPLETO RECHAZAR"},116]
[{"$f":"+MIEMBROS!A174","v":"f PARTICIPACION"},{"$f":"+MIEMBROS!B174","v":0},{"$f":"+MIEMBROS!C174","v":0},{"$f":"+MIEMBROS!D174","v":"PARTICIPACIÓN S/FONDO COMÚN OPERATIVO (%):"},{"$f":"IF(MIEMBROS!E174>0,MIEMBROS!E174,\"INCOMPLETO RECHAZAR\")","v":{"$error":"#DIV/0!"}},117]
[{"$f":"+MIEMBROS!A175","v":"i ORG. REP. LEGAL/ ADM."},{"$f":"+MIEMBROS!B175","v":0},{"$f":"+MIEMBROS!C175","v":0},{"$f":"+MIEMBROS!D175","v":"NOMBRE CARGO REP. LEGAL/ ADMINISTRACIÓN QUE OCUPA:"},{"$f":"IF(MIEMBROS!E175>0,MIEMBROS!E175,\"INCOMPLETO RECHAZAR\")","v":"INCOMPLETO RECHAZAR"},118]
[{"$f":"+MIEMBROS!A168","v":"c MIEMBRO PH"},{"$f":"+MIEMBROS!B168","v":0},{"$f":"+MIEMBROS!C168","v":0},{"$f":"+MIEMBROS!D168","v":"EMAIL:"},{"$f":"IF(MIEMBROS!E168>0,MIEMBROS!E168,\"INCOMPLETO RECHAZAR\")","v":"INCOMPLETO RECHAZAR"},119]
[{"$f":"+MIEMBROS!A169","v":"c MIEMBRO PH"},{"$f":"+MIEMBROS!B169","v":0},{"$f":"+MIEMBROS!C169","v":0},{"$f":"+MIEMBROS!D169","v":"ESTADO CIVIL:"},{"$f":"IF(MIEMBROS!E169>0,MIEMBROS!E169,\"INCOMPLETO RECHAZAR\")","v":"INCOMPLETO RECHAZAR"},120]
[{"$f":"+MIEMBROS!A170","v":"c MIEMBRO PH"},{"$f":"+MIEMBROS!B170","v":0},{"$f":"+MIEMBROS!C170","v":0},{"$f":"+MIEMBROS!D170","v":""},{"$f":"IF(MIEMBROS!E170>0,MIEMBROS!E170,\"INCOMPLETO RECHAZAR\")","v":"INCOMPLETO RECHAZAR"},121]
[{"$f":"+MIEMBROS!A177","v":"c MIEMBRO PH"},{"$f":"+MIEMBROS!B177","v":0},{"$f":"+MIEMBROS!C177","v":0},{"$f":"+MIEMBROS!D177","v":"NOTA/OBSERVACIÓN -en mayúscula-:"},{"$f":"IF(MIEMBROS!E177>0,MIEMBROS!E177,\"INCOMPLETO RECHAZAR\")","v":"INCOMPLETO RECHAZAR"},122]
[{"$f":"+MIEMBROS!A187","v":"c MIEMBRO PH"},{"$f":"+MIEMBROS!B187","v":0},{"$f":"+MIEMBROS!C187","v":0},{"$f":"+MIEMBROS!D187","v":"ESTADO CIVIL:"},{"$f":"IF(MIEMBROS!E187>0,MIEMBROS!E187,\"INCOMPLETO RECHAZAR\")","v":"INCOMPLETO RECHAZAR"},123]
[{"$f":"+MIEMBROS!A171","v":"c MIEMBRO PH"},{"$f":"+MIEMBROS!B171","v":0},{"$f":"+MIEMBROS!C171","v":0},{"$f":"+MIEMBROS!D171","v":""},{"$f":"IF(MIEMBROS!E171>0,MIEMBROS!E171,\"INCOMPLETO RECHAZAR\")","v":"INCOMPLETO RECHAZAR"},124]
[{"$f":"+MIEMBROS!A198","v":"c MIEMBRO PH"},{"$f":"+MIEMBROS!B198","v":0},{"$f":"+MIEMBROS!C198","v":0},{"$f":"+MIEMBROS!D198","v":"FECHA DE NACIMIENTO –dd/mm/aa-:"},{"$f":"IF(MIEMBROS!E198>0,MIEMBROS!E198,\"INCOMPLETO RECHAZAR\")","v":"INCOMPLETO RECHAZAR"},125]
[{"$f":"+MIEMBROS!A195","v":"c MIEMBRO PH"},{"$f":"+MIEMBROS!B195","v":0},{"$f":"+MIEMBROS!C195","v":0},{"$f":"+MIEMBROS!D195","v":"NOTA/OBSERVACIÓN -en mayúscula-:"},{"$f":"IF(MIEMBROS!E195>0,MIEMBROS!E195,\"INCOMPLETO RECHAZAR\")","v":"INCOMPLETO RECHAZAR"},126]
[{"$f":"+MIEMBROS!A189","v":"c MIEMBRO PH"},{"$f":"+MIEMBROS!B189","v":0},{"$f":"+MIEMBROS!C189","v":0},{"$f":"+MIEMBROS!D189","v":""},{"$f":"IF(MIEMBROS!E189>0,MIEMBROS!E189,\"INCOMPLETO RECHAZAR\")","v":"INCOMPLETO RECHAZAR"},127]
[{"$f":"+MIEMBROS!A200","v":"c MIEMBRO PH"},{"$f":"+MIEMBROS!B200","v":0},{"$f":"+MIEMBROS!C200","v":0},{"$f":"+MIEMBROS!D200","v":"NACIONALIDAD:"},{"$f":"IF(MIEMBROS!E200>0,MIEMBROS!E200,\"INCOMPLETO RECHAZAR\")","v":"INCOMPLETO RECHAZAR"},128]
[{"$f":"+MIEMBROS!A188","v":"c MIEMBRO PH"},{"$f":"+MIEMBROS!B188","v":0},{"$f":"+MIEMBROS!C188","v":0},{"$f":"+MIEMBROS!D188","v":""},{"$f":"IF(MIEMBROS!E188>0,MIEMBROS!E188,\"INCOMPLETO RECHAZAR\")","v":"INCOMPLETO RECHAZAR"},129]
[{"$f":"+MIEMBROS!A194","v":"j ORG. FISCALIZ."},{"$f":"+MIEMBROS!B194","v":0},{"$f":"+MIEMBROS!C194","v":0},{"$f":"+MIEMBROS!D194","v":"NOMBRE CARGO FISCALIZACIÓN QUE OCUPA:"},{"$f":"IF(MIEMBROS!E194>0,MIEMBROS!E194,\"INCOMPLETO RECHAZAR\")","v":"INCOMPLETO RECHAZAR"},130]
[{"$f":"+MIEMBROS!A196","v":"c MIEMBRO PH"},{"$f":"+MIEMBROS!B196","v":0},{"$f":"+MIEMBROS!C196","v":0},{"$f":"+MIEMBROS!D196","v":"DOC. IDENTIDAD –sin puntos-:"},{"$f":"IF(MIEMBROS!E196>0,MIEMBROS!E196,\"INCOMPLETO RECHAZAR\")","v":"INCOMPLETO RECHAZAR"},131]
[{"$f":"+MIEMBROS!A197","v":"c MIEMBRO PH"},{"$f":"+MIEMBROS!B197","v":0},{"$f":"+MIEMBROS!C197","v":0},{"$f":"+MIEMBROS!D197","v":"CUIT/CUIL –sin puntos ni barras-:"},{"$f":"IF(MIEMBROS!E197>0,MIEMBROS!E197,\"INCOMPLETO RECHAZAR\")","v":"INCOMPLETO RECHAZAR"},132]
[{"$f":"+MIEMBROS!A190","v":"c MIEMBRO PH"},{"$f":"+MIEMBROS!B190","v":0},{"$f":"+MIEMBROS!C190","v":0},{"$f":"+MIEMBROS!D190","v":""},{"$f":"IF(MIEMBROS!E190>0,MIEMBROS!E190,\"INCOMPLETO RECHAZAR\")","v":"INCOMPLETO RECHAZAR"},133]
[{"$f":"+MIEMBROS!A191","v":"g CONTRIB."},{"$f":"+MIEMBROS!B191","v":0},{"$f":"+MIEMBROS!C191","v":0},{"$f":"+MIEMBROS!D191","v":"CONTRIBUCIÓN -EN PESOS U OTRA MONEDA-:"},{"$f":"IF(MIEMBROS!E191>0,MIEMBROS!E191,\"INCOMPLETO RECHAZAR\")","v":"INCOMPLETO RECHAZAR"},134]
[{"$f":"+MIEMBROS!A192","v":"f PARTICIPACION"},{"$f":"+MIEMBROS!B192","v":0},{"$f":"+MIEMBROS!C192","v":0},{"$f":"+MIEMBROS!D192","v":"PARTICIPACIÓN S/FONDO COMÚN OPERATIVO (%):"},{"$f":"IF(MIEMBROS!E192>0,MIEMBROS!E192,\"INCOMPLETO RECHAZAR\")","v":{"$error":"#DIV/0!"}},135]
[{"$f":"+MIEMBROS!A199","v":"c MIEMBRO PH"},{"$f":"+MIEMBROS!B199","v":0},{"$f":"+MIEMBROS!C199","v":0},{"$f":"+MIEMBROS!D199","v":"LUGAR DE NACIMIENTO:"},{"$f":"IF(MIEMBROS!E199>0,MIEMBROS!E199,\"INCOMPLETO RECHAZAR\")","v":"INCOMPLETO RECHAZAR"},136]
[{"$f":"+MIEMBROS!A209","v":"g CONTRIB."},{"$f":"+MIEMBROS!B209","v":0},{"$f":"+MIEMBROS!C209","v":0},{"$f":"+MIEMBROS!D209","v":"CONTRIBUCIÓN -EN PESOS U OTRA MONEDA-:"},{"$f":"IF(MIEMBROS!E209>0,MIEMBROS!E209,\"INCOMPLETO RECHAZAR\")","v":"INCOMPLETO RECHAZAR"},137]
[{"$f":"+MIEMBROS!A193","v":"i ORG. REP. LEGAL/ ADM."},{"$f":"+MIEMBROS!B193","v":0},{"$f":"+MIEMBROS!C193","v":0},{"$f":"+MIEMBROS!D193","v":"NOMBRE CARGO REP. LEGAL/ ADMINISTRACIÓN QUE OCUPA:"},{"$f":"IF(MIEMBROS!E193>0,MIEMBROS!E193,\"INCOMPLETO RECHAZAR\")","v":"INCOMPLETO RECHAZAR"},138]
[{"$f":"+MIEMBROS!A220","v":"c MIEMBRO PH"},{"$f":"+MIEMBROS!B220","v":0},{"$f":"+MIEMBROS!C220","v":0},{"$f":"+MIEMBROS!D220","v":"DOMICILIO REAL:"},{"$f":"IF(MIEMBROS!E220>0,MIEMBROS!E220,\"INCOMPLETO RECHAZAR\")","v":"INCOMPLETO RECHAZAR"},139]
[{"$f":"+MIEMBROS!A217","v":"c MIEMBRO PH"},{"$f":"+MIEMBROS!B217","v":0},{"$f":"+MIEMBROS!C217","v":0},{"$f":"+MIEMBROS!D217","v":"LUGAR DE NACIMIENTO:"},{"$f":"IF(MIEMBROS!E217>0,MIEMBROS!E217,\"INCOMPLETO RECHAZAR\")","v":"INCOMPLETO RECHAZAR"},140]
[{"$f":"+MIEMBROS!A211","v":"i ORG. REP. LEGAL/ ADM."},{"$f":"+MIEMBROS!B211","v":0},{"$f":"+MIEMBROS!C211","v":0},{"$f":"+MIEMBROS!D211","v":"NOMBRE CARGO REP. LEGAL/ ADMINISTRACIÓN QUE OCUPA:"},{"$f":"IF(MIEMBROS!E211>0,MIEMBROS!E211,\"INCOMPLETO RECHAZAR\")","v":"INCOMPLETO RECHAZAR"},141]
[{"$f":"+MIEMBROS!A222","v":"c MIEMBRO PH"},{"$f":"+MIEMBROS!B222","v":0},{"$f":"+MIEMBROS!C222","v":0},{"$f":"+MIEMBROS!D222","v":"EMAIL:"},{"$f":"IF(MIEMBROS!E222>0,MIEMBROS!E222,\"INCOMPLETO RECHAZAR\")","v":"INCOMPLETO RECHAZAR"},142]
[{"$f":"+MIEMBROS!A210","v":"f PARTICIPACION"},{"$f":"+MIEMBROS!B210","v":0},{"$f":"+MIEMBROS!C210","v":0},{"$f":"+MIEMBROS!D210","v":"PARTICIPACIÓN S/FONDO COMÚN OPERATIVO (%):"},{"$f":"IF(MIEMBROS!E210>0,MIEMBROS!E210,\"INCOMPLETO RECHAZAR\")","v":{"$error":"#DIV/0!"}},143]
[{"$f":"+MIEMBROS!A216","v":"c MIEMBRO PH"},{"$f":"+MIEMBROS!B216","v":0},{"$f":"+MIEMBROS!C216","v":0},{"$f":"+MIEMBROS!D216","v":"FECHA DE NACIMIENTO –dd/mm/aa-:"},{"$f":"IF(MIEMBROS!E216>0,MIEMBROS!E216,\"INCOMPLETO RECHAZAR\")","v":"INCOMPLETO RECHAZAR"},144]
[{"$f":"+MIEMBROS!A218","v":"c MIEMBRO PH"},{"$f":"+MIEMBROS!B218","v":0},{"$f":"+MIEMBROS!C218","v":0},{"$f":"+MIEMBROS!D218","v":"NACIONALIDAD:"},{"$f":"IF(MIEMBROS!E218>0,MIEMBROS!E218,\"INCOMPLETO RECHAZAR\")","v":"INCOMPLETO RECHAZAR"},145]
[{"$f":"+MIEMBROS!A219","v":"c MIEMBRO PH"},{"$f":"+MIEMBROS!B219","v":0},{"$f":"+MIEMBROS!C219","v":0},{"$f":"+MIEMBROS!D219","v":"PROFESIÓN/OFICIO:"},{"$f":"IF(MIEMBROS!E219>0,MIEMBROS!E219,\"INCOMPLETO RECHAZAR\")","v":"INCOMPLETO RECHAZAR"},146]
[{"$f":"+MIEMBROS!A212","v":"j ORG. FISCALIZ."},{"$f":"+MIEMBROS!B212","v":0},{"$f":"+MIEMBROS!C212","v":0},{"$f":"+MIEMBROS!D212","v":"NOMBRE CARGO FISCALIZACIÓN QUE OCUPA:"},{"$f":"IF(MIEMBROS!E212>0,MIEMBROS!E212,\"INCOMPLETO RECHAZAR\")","v":"INCOMPLETO RECHAZAR"},147]
[{"$f":"+MIEMBROS!A213","v":"c MIEMBRO PH"},{"$f":"+MIEMBROS!B213","v":0},{"$f":"+MIEMBROS!C213","v":0},{"$f":"+MIEMBROS!D213","v":"NOTA/OBSERVACIÓN -en mayúscula-:"},{"$f":"IF(MIEMBROS!E213>0,MIEMBROS!E213,\"INCOMPLETO RECHAZAR\")","v":"INCOMPLETO RECHAZAR"},148]
[{"$f":"+MIEMBROS!A214","v":"c MIEMBRO PH"},{"$f":"+MIEMBROS!B214","v":0},{"$f":"+MIEMBROS!C214","v":0},{"$f":"+MIEMBROS!D214","v":"DOC. IDENTIDAD –sin puntos-:"},{"$f":"IF(MIEMBROS!E214>0,MIEMBROS!E214,\"INCOMPLETO RECHAZAR\")","v":"INCOMPLETO RECHAZAR"},149]
[{"$f":"+MIEMBROS!A221","v":"c MIEMBRO PH"},{"$f":"+MIEMBROS!B221","v":0},{"$f":"+MIEMBROS!C221","v":0},{"$f":"+MIEMBROS!D221","v":"CEL/TEL :"},{"$f":"IF(MIEMBROS!E221>0,MIEMBROS!E221,\"INCOMPLETO RECHAZAR\")","v":"INCOMPLETO RECHAZAR"},150]
[{"$f":"+MIEMBROS!A231","v":"c MIEMBRO PH"},{"$f":"+MIEMBROS!B231","v":0},{"$f":"+MIEMBROS!C231","v":0},{"$f":"+MIEMBROS!D231","v":"NOTA/OBSERVACIÓN -en mayúscula-:"},{"$f":"IF(MIEMBROS!E231>0,MIEMBROS!E231,\"INCOMPLETO RECHAZAR\")","v":"INCOMPLETO RECHAZAR"},151]
[{"$f":"+MIEMBROS!A215","v":"c MIEMBRO PH"},{"$f":"+MIEMBROS!B215","v":0},{"$f":"+MIEMBROS!C215","v":0},{"$f":"+MIEMBROS!D215","v":"CUIT/CUIL –sin puntos ni barras-:"},{"$f":"IF(MIEMBROS!E215>0,MIEMBROS!E215,\"INCOMPLETO RECHAZAR\")","v":"INCOMPLETO RECHAZAR"},152]
[{"$f":"+MIEMBROS!A242","v":"c MIEMBRO PH"},{"$f":"+MIEMBROS!B242","v":0},{"$f":"+MIEMBROS!C242","v":0},{"$f":"+MIEMBROS!D242","v":""},{"$f":"IF(MIEMBROS!E242>0,MIEMBROS!E242,\"INCOMPLETO RECHAZAR\")","v":"INCOMPLETO RECHAZAR"},153]
[{"$f":"+MIEMBROS!A239","v":"c MIEMBRO PH"},{"$f":"+MIEMBROS!B239","v":0},{"$f":"+MIEMBROS!C239","v":0},{"$f":"+MIEMBROS!D239","v":"CEL/TEL :"},{"$f":"IF(MIEMBROS!E239>0,MIEMBROS!E239,\"INCOMPLETO RECHAZAR\")","v":"INCOMPLETO RECHAZAR"},154]
[{"$f":"+MIEMBROS!A233","v":"c MIEMBRO PH"},{"$f":"+MIEMBROS!B233","v":0},{"$f":"+MIEMBROS!C233","v":0},{"$f":"+MIEMBROS!D233","v":"CUIT/CUIL –sin puntos ni barras-:"},{"$f":"IF(MIEMBROS!E233>0,MIEMBROS!E233,\"INCOMPLETO RECHAZAR\")","v":"INCOMPLETO RECHAZAR"},155]
[{"$f":"+MIEMBROS!A244","v":"c MIEMBRO PH"},{"$f":"+MIEMBROS!B244","v":0},{"$f":"+MIEMBROS!C244","v":0},{"$f":"+MIEMBROS!D244","v":""},{"$f":"IF(MIEMBROS!E244>0,MIEMBROS!E244,\"INCOMPLETO RECHAZAR\")","v":"INCOMPLETO RECHAZAR"},156]
[{"$f":"+MIEMBROS!A232","v":"c MIEMBRO PH"},{"$f":"+MIEMBROS!B232","v":0},{"$f":"+MIEMBROS!C232","v":0},{"$f":"+MIEMBROS!D232","v":"DOC. IDENTIDAD –sin puntos-:"},{"$f":"IF(MIEMBROS!E232>0,MIEMBROS!E232,\"INCOMPLETO RECHAZAR\")","v":"INCOMPLETO RECHAZAR"},157]
[{"$f":"+MIEMBROS!A238","v":"c MIEMBRO PH"},{"$f":"+MIEMBROS!B238","v":0},{"$f":"+MIEMBROS!C238","v":0},{"$f":"+MIEMBROS!D238","v":"DOMICILIO REAL:"},{"$f":"IF(MIEMBROS!E238>0,MIEMBROS!E238,\"INCOMPLETO RECHAZAR\")","v":"INCOMPLETO RECHAZAR"},158]
[{"$f":"+MIEMBROS!A240","v":"c MIEMBRO PH"},{"$f":"+MIEMBROS!B240","v":0},{"$f":"+MIEMBROS!C240","v":0},{"$f":"+MIEMBROS!D240","v":"EMAIL:"},{"$f":"IF(MIEMBROS!E240>0,MIEMBROS!E240,\"INCOMPLETO RECHAZAR\")","v":"INCOMPLETO RECHAZAR"},159]
[{"$f":"+MIEMBROS!A241","v":"c MIEMBRO PH"},{"$f":"+MIEMBROS!B241","v":0},{"$f":"+MIEMBROS!C241","v":0},{"$f":"+MIEMBROS!D241","v":"ESTADO CIVIL:"},{"$f":"IF(MIEMBROS!E241>0,MIEMBROS!E241,\"INCOMPLETO RECHAZAR\")","v":"INCOMPLETO RECHAZAR"},160]
[{"$f":"+MIEMBROS!A234","v":"c MIEMBRO PH"},{"$f":"+MIEMBROS!B234","v":0},{"$f":"+MIEMBROS!C234","v":0},{"$f":"+MIEMBROS!D234","v":"FECHA DE NACIMIENTO –dd/mm/aa-:"},{"$f":"IF(MIEMBROS!E234>0,MIEMBROS!E234,\"INCOMPLETO RECHAZAR\")","v":"INCOMPLETO RECHAZAR"},161]
[{"$f":"+MIEMBROS!A235","v":"c MIEMBRO PH"},{"$f":"+MIEMBROS!B235","v":0},{"$f":"+MIEMBROS!C235","v":0},{"$f":"+MIEMBROS!D235","v":"LUGAR DE NACIMIENTO:"},{"$f":"IF(MIEMBROS!E235>0,MIEMBROS!E235,\"INCOMPLETO RECHAZAR\")","v":"INCOMPLETO RECHAZAR"},162]
[{"$f":"+MIEMBROS!A236","v":"c MIEMBRO PH"},{"$f":"+MIEMBROS!B236","v":0},{"$f":"+MIEMBROS!C236","v":0},{"$f":"+MIEMBROS!D236","v":"NACIONALIDAD:"},{"$f":"IF(MIEMBROS!E236>0,MIEMBROS!E236,\"INCOMPLETO RECHAZAR\")","v":"INCOMPLETO RECHAZAR"},163]
[{"$f":"+MIEMBROS!A243","v":"c MIEMBRO PH"},{"$f":"+MIEMBROS!B243","v":0},{"$f":"+MIEMBROS!C243","v":0},{"$f":"+MIEMBROS!D243","v":""},{"$f":"IF(MIEMBROS!E243>0,MIEMBROS!E243,\"INCOMPLETO RECHAZAR\")","v":"INCOMPLETO RECHAZAR"},164]
[{"$f":"+MIEMBROS!A253","v":"c MIEMBRO PH"},{"$f":"+MIEMBROS!B253","v":0},{"$f":"+MIEMBROS!C253","v":0},{"$f":"+MIEMBROS!D253","v":"LUGAR DE NACIMIENTO:"},{"$f":"IF(MIEMBROS!E253>0,MIEMBROS!E253,\"INCOMPLETO RECHAZAR\")","v":"INCOMPLETO RECHAZAR"},165]
[{"$f":"+MIEMBROS!A237","v":"c MIEMBRO PH"},{"$f":"+MIEMBROS!B237","v":0},{"$f":"+MIEMBROS!C237","v":0},{"$f":"+MIEMBROS!D237","v":"PROFESIÓN/OFICIO:"},{"$f":"IF(MIEMBROS!E237>0,MIEMBROS!E237,\"INCOMPLETO RECHAZAR\")","v":"INCOMPLETO RECHAZAR"},166]
[{"$f":"+MIEMBROS!A264","v":"f PARTICIPACION"},{"$f":"+MIEMBROS!B264","v":0},{"$f":"+MIEMBROS!C264","v":0},{"$f":"+MIEMBROS!D264","v":"PARTICIPACIÓN S/FONDO COMÚN OPERATIVO (%):"},{"$f":"IF(MIEMBROS!E264>0,MIEMBROS!E264,\"INCOMPLETO RECHAZAR\")","v":{"$error":"#DIV/0!"}},167]
[{"$f":"+MIEMBROS!A261","v":"c MIEMBRO PH"},{"$f":"+MIEMBROS!B261","v":0},{"$f":"+MIEMBROS!C261","v":0},{"$f":"+MIEMBROS!D261","v":""},{"$f":"IF(MIEMBROS!E261>0,MIEMBROS!E261,\"INCOMPLETO RECHAZAR\")","v":"INCOMPLETO RECHAZAR"},168]
[{"$f":"+MIEMBROS!A255","v":"c MIEMBRO PH"},{"$f":"+MIEMBROS!B255","v":0},{"$f":"+MIEMBROS!C255","v":0},{"$f":"+MIEMBROS!D255","v":"PROFESIÓN/OFICIO:"},{"$f":"IF(MIEMBROS!E255>0,MIEMBROS!E255,\"INCOMPLETO RECHAZAR\")","v":"INCOMPLETO RECHAZAR"},169]
[{"$f":"+MIEMBROS!A266","v":"j ORG. FISCALIZ."},{"$f":"+MIEMBROS!B266","v":0},{"$f":"+MIEMBROS!C266","v":0},{"$f":"+MIEMBROS!D266","v":"NOMBRE CARGO FISCALIZACIÓN QUE OCUPA:"},{"$f":"IF(MIEMBROS!E266>0,MIEMBROS!E266,\"INCOMPLETO RECHAZAR\")","v":"INCOMPLETO RECHAZAR"},170]
[{"$f":"+MIEMBROS!A254","v":"c MIEMBRO PH"},{"$f":"+MIEMBROS!B254","v":0},{"$f":"+MIEMBROS!C254","v":0},{"$f":"+MIEMBROS!D254","v":"NACIONALIDAD:"},{"$f":"IF(MIEMBROS!E254>0,MIEMBROS!E254,\"INCOMPLETO RECHAZAR\")","v":"INCOMPLETO RECHAZAR"},171]
[{"$f":"+MIEMBROS!A260","v":"c MIEMBRO PH"},{"$f":"+MIEMBROS!B260","v":0},{"$f":"+MIEMBROS!C260","v":0},{"$f":"+MIEMBROS!D260","v":""},{"$f":"IF(MIEMBROS!E260>0,MIEMBROS!E260,\"INCOMPLETO RECHAZAR\")","v":"INCOMPLETO RECHAZAR"},172]
[{"$f":"+MIEMBROS!A262","v":"c MIEMBRO PH"},{"$f":"+MIEMBROS!B262","v":0},{"$f":"+MIEMBROS!C262","v":0},{"$f":"+MIEMBROS!D262","v":""},{"$f":"IF(MIEMBROS!E262>0,MIEMBROS!E262,\"INCOMPLETO RECHAZAR\")","v":"INCOMPLETO RECHAZAR"},173]
[{"$f":"+MIEMBROS!A263","v":"g CONTRIB."},{"$f":"+MIEMBROS!B263","v":0},{"$f":"+MIEMBROS!C263","v":0},{"$f":"+MIEMBROS!D263","v":"CONTRIBUCIÓN -EN PESOS U OTRA MONEDA-:"},{"$f":"IF(MIEMBROS!E263>0,MIEMBROS!E263,\"INCOMPLETO RECHAZAR\")","v":"INCOMPLETO RECHAZAR"},174]
[{"$f":"+MIEMBROS!A256","v":"c MIEMBRO PH"},{"$f":"+MIEMBROS!B256","v":0},{"$f":"+MIEMBROS!C256","v":0},{"$f":"+MIEMBROS!D256","v":"DOMICILIO REAL:"},{"$f":"IF(MIEMBROS!E256>0,MIEMBROS!E256,\"INCOMPLETO RECHAZAR\")","v":"INCOMPLETO RECHAZAR"},175]
[{"$f":"+MIEMBROS!A257","v":"c MIEMBRO PH"},{"$f":"+MIEMBROS!B257","v":0},{"$f":"+MIEMBROS!C257","v":0},{"$f":"+MIEMBROS!D257","v":"CEL/TEL :"},{"$f":"IF(MIEMBROS!E257>0,MIEMBROS!E257,\"INCOMPLETO RECHAZAR\")","v":"INCOMPLETO RECHAZAR"},176]
[{"$f":"+MIEMBROS!A258","v":"c MIEMBRO PH"},{"$f":"+MIEMBROS!B258","v":0},{"$f":"+MIEMBROS!C258","v":0},{"$f":"+MIEMBROS!D258","v":"EMAIL:"},{"$f":"IF(MIEMBROS!E258>0,MIEMBROS!E258,\"INCOMPLETO RECHAZAR\")","v":"INCOMPLETO RECHAZAR"},177]
[{"$f":"+MIEMBROS!A265","v":"i ORG. REP. LEGAL/ ADM."},{"$f":"+MIEMBROS!B265","v":0},{"$f":"+MIEMBROS!C265","v":0},{"$f":"+MIEMBROS!D265","v":"NOMBRE CARGO REP. LEGAL/ ADMINISTRACIÓN QUE OCUPA:"},{"$f":"IF(MIEMBROS!E265>0,MIEMBROS!E265,\"INCOMPLETO RECHAZAR\")","v":"INCOMPLETO RECHAZAR"},178]
[{"$f":"+MIEMBROS!A259","v":"c MIEMBRO PH"},{"$f":"+MIEMBROS!B259","v":0},{"$f":"+MIEMBROS!C259","v":0},{"$f":"+MIEMBROS!D259","v":"ESTADO CIVIL:"},{"$f":"IF(MIEMBROS!E259>0,MIEMBROS!E259,\"INCOMPLETO RECHAZAR\")","v":"INCOMPLETO RECHAZAR"},180]
[{"$f":"+MIEMBROS!G21","v":"c MIEMBRO PJ"},{"$f":"+MIEMBROS!H21","v":0},{"$f":"+MIEMBROS!H21","v":0},{"$f":"+MIEMBROS!I21","v":"APELLIDO/S, NOMBRE/S,  DNI Y CARGO DE CADA MIEMBRO DE SU ADMINISTRACIÓN:"},{"$f":"IF(MIEMBROS!J21>0,MIEMBROS!J21,\"INCOMPLETO RECHAZAR\")","v":"INCOMPLETO RECHAZAR"},209]
[{"$f":"+MIEMBROS!G24","v":"c MIEMBRO PJ"},{"$f":"+MIEMBROS!H24","v":0},{"$f":"+MIEMBROS!H24","v":0},{"$f":"+MIEMBROS!I24","v":"CEL/TEL :"},{"$f":"IF(MIEMBROS!J24>0,MIEMBROS!J24,\"INCOMPLETO RECHAZAR\")","v":"INCOMPLETO RECHAZAR"},210]
[{"$f":"+MIEMBROS!G16","v":"c MIEMBRO PJ"},{"$f":"+MIEMBROS!H16","v":0},{"$f":"+MIEMBROS!H16","v":0},{"$f":"+MIEMBROS!I16","v":"CUIT –sin puntos ni barras-:"},{"$f":"IF(MIEMBROS!J16>0,MIEMBROS!J16,\"INCOMPLETO RECHAZAR\")","v":"INCOMPLETO RECHAZAR"},211]
[{"$f":"+MIEMBROS!G19","v":"c MIEMBRO PJ"},{"$f":"+MIEMBROS!H19","v":0},{"$f":"+MIEMBROS!H19","v":0},{"$f":"+MIEMBROS!I19","v":"DATOS DE RESOLUCIÓN Y FECHA DE INSCRIPCIÓN:"},{"$f":"IF(MIEMBROS!J19>0,MIEMBROS!J19,\"INCOMPLETO RECHAZAR\")","v":"INCOMPLETO RECHAZAR"},212]
[{"$f":"+MIEMBROS!G22","v":"c MIEMBRO PJ"},{"$f":"+MIEMBROS!H22","v":0},{"$f":"+MIEMBROS!H22","v":0},{"$f":"+MIEMBROS!I22","v":"DOMICILIO SOCIAL:"},{"$f":"IF(MIEMBROS!J22>0,MIEMBROS!J22,\"INCOMPLETO RECHAZAR\")","v":"INCOMPLETO RECHAZAR"},213]
[{"$f":"+MIEMBROS!G20","v":"c MIEMBRO PJ"},{"$f":"+MIEMBROS!H20","v":0},{"$f":"+MIEMBROS!H20","v":0},{"$f":"+MIEMBROS!I20","v":"FECHA DE INSCRIPCION:"},{"$f":"IF(MIEMBROS!J20>0,MIEMBROS!J20,\"INCOMPLETO RECHAZAR\")","v":"INCOMPLETO RECHAZAR"},214]
[{"$f":"+MIEMBROS!G28","v":"c MIEMBRO PJ"},{"$f":"+MIEMBROS!H28","v":0},{"$f":"+MIEMBROS!H28","v":0},{"$f":"+MIEMBROS!I28","v":"NOTA/OBSERVACIÓN -en mayúscula-:"},{"$f":"IF(MIEMBROS!J28>0,MIEMBROS!J28,\"INCOMPLETO RECHAZAR\")","v":"INCOMPLETO RECHAZAR"},215]
[{"$f":"+MIEMBROS!G25","v":"c MIEMBRO PJ"},{"$f":"+MIEMBROS!H25","v":0},{"$f":"+MIEMBROS!H25","v":0},{"$f":"+MIEMBROS!I25","v":"OBJETO PRINCIPAL (EN FORMA RESUMIDA):"},{"$f":"IF(MIEMBROS!J25>0,MIEMBROS!J25,\"INCOMPLETO RECHAZAR\")","v":"INCOMPLETO RECHAZAR"},216]
[{"$f":"+MIEMBROS!G18","v":"c MIEMBRO PJ"},{"$f":"+MIEMBROS!H18","v":0},{"$f":"+MIEMBROS!H18","v":0},{"$f":"+MIEMBROS!I18","v":"ORGANISMO /s DONDE SE INSCRIBIÓ CONSTITUCIÓN (INDICAR LOCALIDAD/PCIA DEL ORG) -si no se inscribió poner: NO INSCRIPTO/A:"},{"$f":"IF(MIEMBROS!J18>0,MIEMBROS!J18,\"INCOMPLETO RECHAZAR\")","v":"INCOMPLETO RECHAZAR"},217]
[{"$f":"+MIEMBROS!G23","v":"c MIEMBRO PJ"},{"$f":"+MIEMBROS!H23","v":0},{"$f":"+MIEMBROS!H23","v":0},{"$f":"+MIEMBROS!I23","v":"SEDE SOCIAL:"},{"$f":"IF(MIEMBROS!J23>0,MIEMBROS!J23,\"INCOMPLETO RECHAZAR\")","v":"INCOMPLETO RECHAZAR"},218]
[{"$f":"+MIEMBROS!G17","v":"c MIEMBRO PJ"},{"$f":"+MIEMBROS!H17","v":0},{"$f":"+MIEMBROS!H17","v":0},{"$f":"+MIEMBROS!I17","v":"TIPO DE PERSONA JCA -UNIÓN TRANSITORIA, asociación, mutual, etc-:"},{"$f":"IF(MIEMBROS!J17>0,MIEMBROS!J17,\"INCOMPLETO RECHAZAR\")","v":"INCOMPLETO RECHAZAR"},219]
[{"$f":"+MIEMBROS!G34","v":"c MIEMBRO PJ"},{"$f":"+MIEMBROS!H34","v":0},{"$f":"+MIEMBROS!H34","v":0},{"$f":"+MIEMBROS!I34","v":"APELLIDO/S, NOMBRE/S,  DNI Y CARGO DE CADA MIEMBRO DE SU ADMINISTRACIÓN:"},{"$f":"IF(MIEMBROS!J34>0,MIEMBROS!J34,\"INCOMPLETO RECHAZAR\")","v":"INCOMPLETO RECHAZAR"},220]
[{"$f":"+MIEMBROS!G37","v":"c MIEMBRO PJ"},{"$f":"+MIEMBROS!H37","v":0},{"$f":"+MIEMBROS!H37","v":0},{"$f":"+MIEMBROS!I37","v":"CEL/TEL :"},{"$f":"IF(MIEMBROS!J37>0,MIEMBROS!J37,\"INCOMPLETO RECHAZAR\")","v":"INCOMPLETO RECHAZAR"},221]
[{"$f":"+MIEMBROS!G29","v":"c MIEMBRO PJ"},{"$f":"+MIEMBROS!H29","v":0},{"$f":"+MIEMBROS!H29","v":0},{"$f":"+MIEMBROS!I29","v":"CUIT –sin puntos ni barras-:"},{"$f":"IF(MIEMBROS!J29>0,MIEMBROS!J29,\"INCOMPLETO RECHAZAR\")","v":"INCOMPLETO RECHAZAR"},222]
[{"$f":"+MIEMBROS!G32","v":"c MIEMBRO PJ"},{"$f":"+MIEMBROS!H32","v":0},{"$f":"+MIEMBROS!H32","v":0},{"$f":"+MIEMBROS!I32","v":"DATOS DE RESOLUCIÓN Y FECHA DE INSCRIPCIÓN:"},{"$f":"IF(MIEMBROS!J32>0,MIEMBROS!J32,\"INCOMPLETO RECHAZAR\")","v":"INCOMPLETO RECHAZAR"},223]
[{"$f":"+MIEMBROS!G35","v":"c MIEMBRO PJ"},{"$f":"+MIEMBROS!H35","v":0},{"$f":"+MIEMBROS!H35","v":0},{"$f":"+MIEMBROS!I35","v":"DOMICILIO SOCIAL:"},{"$f":"IF(MIEMBROS!J35>0,MIEMBROS!J35,\"INCOMPLETO RECHAZAR\")","v":"INCOMPLETO RECHAZAR"},224]
[{"$f":"+MIEMBROS!G33","v":"c MIEMBRO PJ"},{"$f":"+MIEMBROS!H33","v":0},{"$f":"+MIEMBROS!H33","v":0},{"$f":"+MIEMBROS!I33","v":"FECHA DE INSCRIPCION:"},{"$f":"IF(MIEMBROS!J33>0,MIEMBROS!J33,\"INCOMPLETO RECHAZAR\")","v":"INCOMPLETO RECHAZAR"},225]
[{"$f":"+MIEMBROS!G45","v":"c MIEMBRO PJ"},{"$f":"+MIEMBROS!H45","v":0},{"$f":"+MIEMBROS!H45","v":0},{"$f":"+MIEMBROS!I45","v":"DATOS DE RESOLUCIÓN Y FECHA DE INSCRIPCIÓN:"},{"$f":"IF(MIEMBROS!J45>0,MIEMBROS!J45,\"INCOMPLETO RECHAZAR\")","v":"INCOMPLETO RECHAZAR"},226]
[{"$f":"+MIEMBROS!G38","v":"c MIEMBRO PJ"},{"$f":"+MIEMBROS!H38","v":0},{"$f":"+MIEMBROS!H38","v":0},{"$f":"+MIEMBROS!I38","v":"OBJETO PRINCIPAL (EN FORMA RESUMIDA):"},{"$f":"IF(MIEMBROS!J38>0,MIEMBROS!J38,\"INCOMPLETO RECHAZAR\")","v":"INCOMPLETO RECHAZAR"},227]
[{"$f":"+MIEMBROS!G31","v":"c MIEMBRO PJ"},{"$f":"+MIEMBROS!H31","v":0},{"$f":"+MIEMBROS!H31","v":0},{"$f":"+MIEMBROS!I31","v":"ORGANISMO /s DONDE SE INSCRIBIÓ CONSTITUCIÓN (INDICAR LOCALIDAD/PCIA DEL ORG) -si no se inscribió poner: NO INSCRIPTO/A:"},{"$f":"IF(MIEMBROS!J31>0,MIEMBROS!J31,\"INCOMPLETO RECHAZAR\")","v":"INCOMPLETO RECHAZAR"},228]
[{"$f":"+MIEMBROS!G36","v":"c MIEMBRO PJ"},{"$f":"+MIEMBROS!H36","v":0},{"$f":"+MIEMBROS!H36","v":0},{"$f":"+MIEMBROS!I36","v":"SEDE SOCIAL:"},{"$f":"IF(MIEMBROS!J36>0,MIEMBROS!J36,\"INCOMPLETO RECHAZAR\")","v":"INCOMPLETO RECHAZAR"},229]
[{"$f":"+MIEMBROS!G30","v":"c MIEMBRO PJ"},{"$f":"+MIEMBROS!H30","v":0},{"$f":"+MIEMBROS!H30","v":0},{"$f":"+MIEMBROS!I30","v":"TIPO DE PERSONA JCA -UNIÓN TRANSITORIA, asociación, mutual, etc-:"},{"$f":"IF(MIEMBROS!J30>0,MIEMBROS!J30,\"INCOMPLETO RECHAZAR\")","v":"INCOMPLETO RECHAZAR"},230]
[{"$f":"+MIEMBROS!G51","v":"c MIEMBRO PJ"},{"$f":"+MIEMBROS!H51","v":0},{"$f":"+MIEMBROS!H51","v":0},{"$f":"+MIEMBROS!I51","v":"OBJETO PRINCIPAL (EN FORMA RESUMIDA):"},{"$f":"IF(MIEMBROS!J51>0,MIEMBROS!J51,\"INCOMPLETO RECHAZAR\")","v":"INCOMPLETO RECHAZAR"},231]
[{"$f":"+MIEMBROS!G54","v":"c MIEMBRO PJ"},{"$f":"+MIEMBROS!H54","v":0},{"$f":"+MIEMBROS!H54","v":0},{"$f":"+MIEMBROS!I54","v":"NOTA/OBSERVACIÓN -en mayúscula-:"},{"$f":"IF(MIEMBROS!J54>0,MIEMBROS!J54,\"INCOMPLETO RECHAZAR\")","v":"INCOMPLETO RECHAZAR"},232]
[{"$f":"+MIEMBROS!G46","v":"c MIEMBRO PJ"},{"$f":"+MIEMBROS!H46","v":0},{"$f":"+MIEMBROS!H46","v":0},{"$f":"+MIEMBROS!I46","v":"FECHA DE INSCRIPCION:"},{"$f":"IF(MIEMBROS!J46>0,MIEMBROS!J46,\"INCOMPLETO RECHAZAR\")","v":"INCOMPLETO RECHAZAR"},233]
[{"$f":"+MIEMBROS!G49","v":"c MIEMBRO PJ"},{"$f":"+MIEMBROS!H49","v":0},{"$f":"+MIEMBROS!H49","v":0},{"$f":"+MIEMBROS!I49","v":"SEDE SOCIAL:"},{"$f":"IF(MIEMBROS!J49>0,MIEMBROS!J49,\"INCOMPLETO RECHAZAR\")","v":"INCOMPLETO RECHAZAR"},234]
[{"$f":"+MIEMBROS!G52","v":"d CONTRIB."},{"$f":"+MIEMBROS!H52","v":0},{"$f":"+MIEMBROS!H52","v":0},{"$f":"+MIEMBROS!I52","v":"CONTRIBUCIÓN -EN PESOS U OTRA MONEDA-:"},{"$f":"IF(MIEMBROS!J52>0,MIEMBROS!J52,\"INCOMPLETO RECHAZAR\")","v":"INCOMPLETO RECHAZAR"},235]
[{"$f":"+MIEMBROS!G50","v":"c MIEMBRO PJ"},{"$f":"+MIEMBROS!H50","v":0},{"$f":"+MIEMBROS!H50","v":0},{"$f":"+MIEMBROS!I50","v":"CEL/TEL :"},{"$f":"IF(MIEMBROS!J50>0,MIEMBROS!J50,\"INCOMPLETO RECHAZAR\")","v":"INCOMPLETO RECHAZAR"},236]
[{"$f":"+MIEMBROS!G62","v":"c MIEMBRO PJ"},{"$f":"+MIEMBROS!H62","v":0},{"$f":"+MIEMBROS!H62","v":0},{"$f":"+MIEMBROS!I62","v":"SEDE SOCIAL:"},{"$f":"IF(MIEMBROS!J62>0,MIEMBROS!J62,\"INCOMPLETO RECHAZAR\")","v":"INCOMPLETO RECHAZAR"},237]
[{"$f":"+MIEMBROS!G55","v":"c MIEMBRO PJ"},{"$f":"+MIEMBROS!H55","v":0},{"$f":"+MIEMBROS!H55","v":0},{"$f":"+MIEMBROS!I55","v":"CUIT –sin puntos ni barras-:"},{"$f":"IF(MIEMBROS!J55>0,MIEMBROS!J55,\"INCOMPLETO RECHAZAR\")","v":"INCOMPLETO RECHAZAR"},238]
[{"$f":"+MIEMBROS!G48","v":"c MIEMBRO PJ"},{"$f":"+MIEMBROS!H48","v":0},{"$f":"+MIEMBROS!H48","v":0},{"$f":"+MIEMBROS!I48","v":"DOMICILIO SOCIAL:"},{"$f":"IF(MIEMBROS!J48>0,MIEMBROS!J48,\"INCOMPLETO RECHAZAR\")","v":"INCOMPLETO RECHAZAR"},239]
[{"$f":"+MIEMBROS!G53","v":"d CONTRIB."},{"$f":"+MIEMBROS!H53","v":0},{"$f":"+MIEMBROS!H53","v":0},{"$f":"+MIEMBROS!I53","v":"PARTICIPACIÓN S/FONDO COMÚN OPERATIVO (%):"},{"$f":"IF(MIEMBROS!J53>0,MIEMBROS!J53,\"INCOMPLETO RECHAZAR\")","v":{"$error":"#DIV/0!"}},240]
[{"$f":"+MIEMBROS!G47","v":"c MIEMBRO PJ"},{"$f":"+MIEMBROS!H47","v":0},{"$f":"+MIEMBROS!H47","v":0},{"$f":"+MIEMBROS!I47","v":"APELLIDO/S, NOMBRE/S,  DNI Y CARGO DE CADA MIEMBRO DE SU ADMINISTRACIÓN:"},{"$f":"IF(MIEMBROS!J47>0,MIEMBROS!J47,\"INCOMPLETO RECHAZAR\")","v":"INCOMPLETO RECHAZAR"},241]
[{"$f":"+MIEMBROS!G68","v":"c MIEMBRO PJ"},{"$f":"+MIEMBROS!H68","v":0},{"$f":"+MIEMBROS!H68","v":0},{"$f":"+MIEMBROS!I68","v":"CUIT –sin puntos ni barras-:"},{"$f":"IF(MIEMBROS!J68>0,MIEMBROS!J68,\"INCOMPLETO RECHAZAR\")","v":"INCOMPLETO RECHAZAR"},242]
[{"$f":"+MIEMBROS!G71","v":"c MIEMBRO PJ"},{"$f":"+MIEMBROS!H71","v":0},{"$f":"+MIEMBROS!H71","v":0},{"$f":"+MIEMBROS!I71","v":"DATOS DE RESOLUCIÓN Y FECHA DE INSCRIPCIÓN:"},{"$f":"IF(MIEMBROS!J71>0,MIEMBROS!J71,\"INCOMPLETO RECHAZAR\")","v":"INCOMPLETO RECHAZAR"},243]
[{"$f":"+MIEMBROS!G63","v":"c MIEMBRO PJ"},{"$f":"+MIEMBROS!H63","v":0},{"$f":"+MIEMBROS!H63","v":0},{"$f":"+MIEMBROS!I63","v":"CEL/TEL :"},{"$f":"IF(MIEMBROS!J63>0,MIEMBROS!J63,\"INCOMPLETO RECHAZAR\")","v":"INCOMPLETO RECHAZAR"},244]
[{"$f":"+MIEMBROS!G66","v":"d CONTRIB."},{"$f":"+MIEMBROS!H66","v":0},{"$f":"+MIEMBROS!H66","v":0},{"$f":"+MIEMBROS!I66","v":"PARTICIPACIÓN S/FONDO COMÚN OPERATIVO (%):"},{"$f":"IF(MIEMBROS!J66>0,MIEMBROS!J66,\"INCOMPLETO RECHAZAR\")","v":{"$error":"#DIV/0!"}},245]
[{"$f":"+MIEMBROS!G69","v":"c MIEMBRO PJ"},{"$f":"+MIEMBROS!H69","v":0},{"$f":"+MIEMBROS!H69","v":0},{"$f":"+MIEMBROS!I69","v":"TIPO DE PERSONA JCA -UNIÓN TRANSITORIA, asociación, mutual, etc-:"},{"$f":"IF(MIEMBROS!J69>0,MIEMBROS!J69,\"INCOMPLETO RECHAZAR\")","v":"INCOMPLETO RECHAZAR"},246]
[{"$f":"+MIEMBROS!G67","v":"c MIEMBRO PJ"},{"$f":"+MIEMBROS!H67","v":0},{"$f":"+MIEMBROS!H67","v":0},{"$f":"+MIEMBROS!I67","v":"NOTA/OBSERVACIÓN -en mayúscula-:"},{"$f":"IF(MIEMBROS!J67>0,MIEMBROS!J67,\"INCOMPLETO RECHAZAR\")","v":"INCOMPLETO RECHAZAR"},247]
[{"$f":"+MIEMBROS!G79","v":"d CONTRIB."},{"$f":"+MIEMBROS!H79","v":0},{"$f":"+MIEMBROS!H79","v":0},{"$f":"+MIEMBROS!I79","v":"PARTICIPACIÓN S/FONDO COMÚN OPERATIVO (%):"},{"$f":"IF(MIEMBROS!J79>0,MIEMBROS!J79,\"INCOMPLETO RECHAZAR\")","v":{"$error":"#DIV/0!"}},248]
[{"$f":"+MIEMBROS!G72","v":"c MIEMBRO PJ"},{"$f":"+MIEMBROS!H72","v":0},{"$f":"+MIEMBROS!H72","v":0},{"$f":"+MIEMBROS!I72","v":"FECHA DE INSCRIPCION:"},{"$f":"IF(MIEMBROS!J72>0,MIEMBROS!J72,\"INCOMPLETO RECHAZAR\")","v":"INCOMPLETO RECHAZAR"},249]
[{"$f":"+MIEMBROS!G65","v":"d CONTRIB."},{"$f":"+MIEMBROS!H65","v":0},{"$f":"+MIEMBROS!H65","v":0},{"$f":"+MIEMBROS!I65","v":"CONTRIBUCIÓN -EN PESOS U OTRA MONEDA-:"},{"$f":"IF(MIEMBROS!J65>0,MIEMBROS!J65,\"INCOMPLETO RECHAZAR\")","v":"INCOMPLETO RECHAZAR"},250]
[{"$f":"+MIEMBROS!G70","v":"c MIEMBRO PJ"},{"$f":"+MIEMBROS!H70","v":0},{"$f":"+MIEMBROS!H70","v":0},{"$f":"+MIEMBROS!I70","v":"ORGANISMO /s DONDE SE INSCRIBIÓ CONSTITUCIÓN (INDICAR LOCALIDAD/PCIA DEL ORG) -si no se inscribió poner: NO INSCRIPTO/A:"},{"$f":"IF(MIEMBROS!J70>0,MIEMBROS!J70,\"INCOMPLETO RECHAZAR\")","v":"INCOMPLETO RECHAZAR"},251]
[{"$f":"+MIEMBROS!G64","v":"c MIEMBRO PJ"},{"$f":"+MIEMBROS!H64","v":0},{"$f":"+MIEMBROS!H64","v":0},{"$f":"+MIEMBROS!I64","v":"OBJETO PRINCIPAL (EN FORMA RESUMIDA):"},{"$f":"IF(MIEMBROS!J64>0,MIEMBROS!J64,\"INCOMPLETO RECHAZAR\")","v":"INCOMPLETO RECHAZAR"},252]
[{"$f":"+MIEMBROS!G85","v":"c MIEMBRO PJ"},{"$f":"+MIEMBROS!H85","v":0},{"$f":"+MIEMBROS!H85","v":0},{"$f":"+MIEMBROS!I85","v":"FECHA DE INSCRIPCION:"},{"$f":"IF(MIEMBROS!J85>0,MIEMBROS!J85,\"INCOMPLETO RECHAZAR\")","v":"INCOMPLETO RECHAZAR"},253]
[{"$f":"+MIEMBROS!G88","v":"c MIEMBRO PJ"},{"$f":"+MIEMBROS!H88","v":0},{"$f":"+MIEMBROS!H88","v":0},{"$f":"+MIEMBROS!I88","v":"SEDE SOCIAL:"},{"$f":"IF(MIEMBROS!J88>0,MIEMBROS!J88,\"INCOMPLETO RECHAZAR\")","v":"INCOMPLETO RECHAZAR"},254]
[{"$f":"+MIEMBROS!G80","v":"c MIEMBRO PJ"},{"$f":"+MIEMBROS!H80","v":0},{"$f":"+MIEMBROS!H80","v":0},{"$f":"+MIEMBROS!I80","v":"NOTA/OBSERVACIÓN -en mayúscula-:"},{"$f":"IF(MIEMBROS!J80>0,MIEMBROS!J80,\"INCOMPLETO RECHAZAR\")","v":"INCOMPLETO RECHAZAR"},255]
[{"$f":"+MIEMBROS!G83","v":"c MIEMBRO PJ"},{"$f":"+MIEMBROS!H83","v":0},{"$f":"+MIEMBROS!H83","v":0},{"$f":"+MIEMBROS!I83","v":"ORGANISMO /s DONDE SE INSCRIBIÓ CONSTITUCIÓN (INDICAR LOCALIDAD/PCIA DEL ORG) -si no se inscribió poner: NO INSCRIPTO/A:"},{"$f":"IF(MIEMBROS!J83>0,MIEMBROS!J83,\"INCOMPLETO RECHAZAR\")","v":"INCOMPLETO RECHAZAR"},256]
[{"$f":"+MIEMBROS!G86","v":"c MIEMBRO PJ"},{"$f":"+MIEMBROS!H86","v":0},{"$f":"+MIEMBROS!H86","v":0},{"$f":"+MIEMBROS!I86","v":"APELLIDO/S, NOMBRE/S,  DNI Y CARGO DE CADA MIEMBRO DE SU ADMINISTRACIÓN:"},{"$f":"IF(MIEMBROS!J86>0,MIEMBROS!J86,\"INCOMPLETO RECHAZAR\")","v":"INCOMPLETO RECHAZAR"},257]
[{"$f":"+MIEMBROS!G84","v":"c MIEMBRO PJ"},{"$f":"+MIEMBROS!H84","v":0},{"$f":"+MIEMBROS!H84","v":0},{"$f":"+MIEMBROS!I84","v":"DATOS DE RESOLUCIÓN Y FECHA DE INSCRIPCIÓN:"},{"$f":"IF(MIEMBROS!J84>0,MIEMBROS!J84,\"INCOMPLETO RECHAZAR\")","v":"INCOMPLETO RECHAZAR"},258]
[{"$f":"+MIEMBROS!G96","v":"c MIEMBRO PJ"},{"$f":"+MIEMBROS!H96","v":0},{"$f":"+MIEMBROS!H96","v":0},{"$f":"+MIEMBROS!I96","v":"ORGANISMO /s DONDE SE INSCRIBIÓ CONSTITUCIÓN (INDICAR LOCALIDAD/PCIA DEL ORG) -si no se inscribió poner: NO INSCRIPTO/A:"},{"$f":"IF(MIEMBROS!J96>0,MIEMBROS!J96,\"INCOMPLETO RECHAZAR\")","v":"INCOMPLETO RECHAZAR"},259]
[{"$f":"+MIEMBROS!G89","v":"c MIEMBRO PJ"},{"$f":"+MIEMBROS!H89","v":0},{"$f":"+MIEMBROS!H89","v":0},{"$f":"+MIEMBROS!I89","v":"CEL/TEL :"},{"$f":"IF(MIEMBROS!J89>0,MIEMBROS!J89,\"INCOMPLETO RECHAZAR\")","v":"INCOMPLETO RECHAZAR"},260]
[{"$f":"+MIEMBROS!G82","v":"c MIEMBRO PJ"},{"$f":"+MIEMBROS!H82","v":0},{"$f":"+MIEMBROS!H82","v":0},{"$f":"+MIEMBROS!I82","v":"TIPO DE PERSONA JCA -UNIÓN TRANSITORIA, asociación, mutual, etc-:"},{"$f":"IF(MIEMBROS!J82>0,MIEMBROS!J82,\"INCOMPLETO RECHAZAR\")","v":"INCOMPLETO RECHAZAR"},261]
[{"$f":"+MIEMBROS!G87","v":"c MIEMBRO PJ"},{"$f":"+MIEMBROS!H87","v":0},{"$f":"+MIEMBROS!H87","v":0},{"$f":"+MIEMBROS!I87","v":"DOMICILIO SOCIAL:"},{"$f":"IF(MIEMBROS!J87>0,MIEMBROS!J87,\"INCOMPLETO RECHAZAR\")","v":"INCOMPLETO RECHAZAR"},262]
[{"$f":"+MIEMBROS!G81","v":"c MIEMBRO PJ"},{"$f":"+MIEMBROS!H81","v":0},{"$f":"+MIEMBROS!H81","v":0},{"$f":"+MIEMBROS!I81","v":"CUIT –sin puntos ni barras-:"},{"$f":"IF(MIEMBROS!J81>0,MIEMBROS!J81,\"INCOMPLETO RECHAZAR\")","v":"INCOMPLETO RECHAZAR"},263]
[{"$f":"+MIEMBROS!G102","v":"c MIEMBRO PJ"},{"$f":"+MIEMBROS!H102","v":0},{"$f":"+MIEMBROS!H102","v":0},{"$f":"+MIEMBROS!I102","v":"CEL/TEL :"},{"$f":"IF(MIEMBROS!J102>0,MIEMBROS!J102,\"INCOMPLETO RECHAZAR\")","v":"INCOMPLETO RECHAZAR"},264]
[{"$f":"+MIEMBROS!G105","v":"d CONTRIB."},{"$f":"+MIEMBROS!H105","v":0},{"$f":"+MIEMBROS!H105","v":0},{"$f":"+MIEMBROS!I105","v":"PARTICIPACIÓN S/FONDO COMÚN OPERATIVO (%):"},{"$f":"IF(MIEMBROS!J105>0,MIEMBROS!J105,\"INCOMPLETO RECHAZAR\")","v":{"$error":"#DIV/0!"}},265]
[{"$f":"+MIEMBROS!G97","v":"c MIEMBRO PJ"},{"$f":"+MIEMBROS!H97","v":0},{"$f":"+MIEMBROS!H97","v":0},{"$f":"+MIEMBROS!I97","v":"DATOS DE RESOLUCIÓN Y FECHA DE INSCRIPCIÓN:"},{"$f":"IF(MIEMBROS!J97>0,MIEMBROS!J97,\"INCOMPLETO RECHAZAR\")","v":"INCOMPLETO RECHAZAR"},266]
[{"$f":"+MIEMBROS!G100","v":"c MIEMBRO PJ"},{"$f":"+MIEMBROS!H100","v":0},{"$f":"+MIEMBROS!H100","v":0},{"$f":"+MIEMBROS!I100","v":"DOMICILIO SOCIAL:"},{"$f":"IF(MIEMBROS!J100>0,MIEMBROS!J100,\"INCOMPLETO RECHAZAR\")","v":"INCOMPLETO RECHAZAR"},267]
[{"$f":"+MIEMBROS!G103","v":"c MIEMBRO PJ"},{"$f":"+MIEMBROS!H103","v":0},{"$f":"+MIEMBROS!H103","v":0},{"$f":"+MIEMBROS!I103","v":"OBJETO PRINCIPAL (EN FORMA RESUMIDA):"},{"$f":"IF(MIEMBROS!J103>0,MIEMBROS!J103,\"INCOMPLETO RECHAZAR\")","v":"INCOMPLETO RECHAZAR"},268]
[{"$f":"+MIEMBROS!G101","v":"c MIEMBRO PJ"},{"$f":"+MIEMBROS!H101","v":0},{"$f":"+MIEMBROS!H101","v":0},{"$f":"+MIEMBROS!I101","v":"SEDE SOCIAL:"},{"$f":"IF(MIEMBROS!J101>0,MIEMBROS!J101,\"INCOMPLETO RECHAZAR\")","v":"INCOMPLETO RECHAZAR"},269]
[{"$f":"+MIEMBROS!G113","v":"c MIEMBRO PJ"},{"$f":"+MIEMBROS!H113","v":0},{"$f":"+MIEMBROS!H113","v":0},{"$f":"+MIEMBROS!I113","v":"DOMICILIO SOCIAL:"},{"$f":"IF(MIEMBROS!J113>0,MIEMBROS!J113,\"INCOMPLETO RECHAZAR\")","v":"INCOMPLETO RECHAZAR"},270]
[{"$f":"+MIEMBROS!G106","v":"c MIEMBRO PJ"},{"$f":"+MIEMBROS!H106","v":0},{"$f":"+MIEMBROS!H106","v":0},{"$f":"+MIEMBROS!I106","v":"NOTA/OBSERVACIÓN -en mayúscula-:"},{"$f":"IF(MIEMBROS!J106>0,MIEMBROS!J106,\"INCOMPLETO RECHAZAR\")","v":"INCOMPLETO RECHAZAR"},271]
[{"$f":"+MIEMBROS!G99","v":"c MIEMBRO PJ"},{"$f":"+MIEMBROS!H99","v":0},{"$f":"+MIEMBROS!H99","v":0},{"$f":"+MIEMBROS!I99","v":"APELLIDO/S, NOMBRE/S,  DNI Y CARGO DE CADA MIEMBRO DE SU ADMINISTRACIÓN:"},{"$f":"IF(MIEMBROS!J99>0,MIEMBROS!J99,\"INCOMPLETO RECHAZAR\")","v":"INCOMPLETO RECHAZAR"},272]
[{"$f":"+MIEMBROS!G104","v":"d CONTRIB."},{"$f":"+MIEMBROS!H104","v":0},{"$f":"+MIEMBROS!H104","v":0},{"$f":"+MIEMBROS!I104","v":"CONTRIBUCIÓN -EN PESOS U OTRA MONEDA-:"},{"$f":"IF(MIEMBROS!J104>0,MIEMBROS!J104,\"INCOMPLETO RECHAZAR\")","v":"INCOMPLETO RECHAZAR"},273]
[{"$f":"+MIEMBROS!G98","v":"c MIEMBRO PJ"},{"$f":"+MIEMBROS!H98","v":0},{"$f":"+MIEMBROS!H98","v":0},{"$f":"+MIEMBROS!I98","v":"FECHA DE INSCRIPCION:"},{"$f":"IF(MIEMBROS!J98>0,MIEMBROS!J98,\"INCOMPLETO RECHAZAR\")","v":"INCOMPLETO RECHAZAR"},274]
[{"$f":"+MIEMBROS!G119","v":"c MIEMBRO PJ"},{"$f":"+MIEMBROS!H119","v":0},{"$f":"+MIEMBROS!H119","v":0},{"$f":"+MIEMBROS!I119","v":"NOTA/OBSERVACIÓN -en mayúscula-:"},{"$f":"IF(MIEMBROS!J119>0,MIEMBROS!J119,\"INCOMPLETO RECHAZAR\")","v":"INCOMPLETO RECHAZAR"},275]
[{"$f":"+MIEMBROS!G122","v":"c MIEMBRO PJ"},{"$f":"+MIEMBROS!H122","v":0},{"$f":"+MIEMBROS!H122","v":0},{"$f":"+MIEMBROS!I122","v":"ORGANISMO /s DONDE SE INSCRIBIÓ CONSTITUCIÓN (INDICAR LOCALIDAD/PCIA DEL ORG) -si no se inscribió poner: NO INSCRIPTO/A:"},{"$f":"IF(MIEMBROS!J122>0,MIEMBROS!J122,\"INCOMPLETO RECHAZAR\")","v":"INCOMPLETO RECHAZAR"},276]
[{"$f":"+MIEMBROS!G114","v":"c MIEMBRO PJ"},{"$f":"+MIEMBROS!H114","v":0},{"$f":"+MIEMBROS!H114","v":0},{"$f":"+MIEMBROS!I114","v":"SEDE SOCIAL:"},{"$f":"IF(MIEMBROS!J114>0,MIEMBROS!J114,\"INCOMPLETO RECHAZAR\")","v":"INCOMPLETO RECHAZAR"},277]
[{"$f":"+MIEMBROS!G117","v":"d CONTRIB."},{"$f":"+MIEMBROS!H117","v":0},{"$f":"+MIEMBROS!H117","v":0},{"$f":"+MIEMBROS!I117","v":"CONTRIBUCIÓN -EN PESOS U OTRA MONEDA-:"},{"$f":"IF(MIEMBROS!J117>0,MIEMBROS!J117,\"INCOMPLETO RECHAZAR\")","v":"INCOMPLETO RECHAZAR"},278]
[{"$f":"+MIEMBROS!G120","v":"c MIEMBRO PJ"},{"$f":"+MIEMBROS!H120","v":0},{"$f":"+MIEMBROS!H120","v":0},{"$f":"+MIEMBROS!I120","v":"CUIT –sin puntos ni barras-:"},{"$f":"IF(MIEMBROS!J120>0,MIEMBROS!J120,\"INCOMPLETO RECHAZAR\")","v":"INCOMPLETO RECHAZAR"},279]
[{"$f":"+MIEMBROS!G118","v":"d CONTRIB."},{"$f":"+MIEMBROS!H118","v":0},{"$f":"+MIEMBROS!H118","v":0},{"$f":"+MIEMBROS!I118","v":"PARTICIPACIÓN S/FONDO COMÚN OPERATIVO (%):"},{"$f":"IF(MIEMBROS!J118>0,MIEMBROS!J118,\"INCOMPLETO RECHAZAR\")","v":{"$error":"#DIV/0!"}},280]
[{"$f":"+MIEMBROS!G130","v":"d CONTRIB."},{"$f":"+MIEMBROS!H130","v":0},{"$f":"+MIEMBROS!H130","v":0},{"$f":"+MIEMBROS!I130","v":"CONTRIBUCIÓN -EN PESOS U OTRA MONEDA-:"},{"$f":"IF(MIEMBROS!J130>0,MIEMBROS!J130,\"INCOMPLETO RECHAZAR\")","v":"INCOMPLETO RECHAZAR"},281]
[{"$f":"+MIEMBROS!G123","v":"c MIEMBRO PJ"},{"$f":"+MIEMBROS!H123","v":0},{"$f":"+MIEMBROS!H123","v":0},{"$f":"+MIEMBROS!I123","v":"DATOS DE RESOLUCIÓN Y FECHA DE INSCRIPCIÓN:"},{"$f":"IF(MIEMBROS!J123>0,MIEMBROS!J123,\"INCOMPLETO RECHAZAR\")","v":"INCOMPLETO RECHAZAR"},282]
[{"$f":"+MIEMBROS!G116","v":"c MIEMBRO PJ"},{"$f":"+MIEMBROS!H116","v":0},{"$f":"+MIEMBROS!H116","v":0},{"$f":"+MIEMBROS!I116","v":"OBJETO PRINCIPAL (EN FORMA RESUMIDA):"},{"$f":"IF(MIEMBROS!J116>0,MIEMBROS!J116,\"INCOMPLETO RECHAZAR\")","v":"INCOMPLETO RECHAZAR"},283]
[{"$f":"+MIEMBROS!G121","v":"c MIEMBRO PJ"},{"$f":"+MIEMBROS!H121","v":0},{"$f":"+MIEMBROS!H121","v":0},{"$f":"+MIEMBROS!I121","v":"TIPO DE PERSONA JCA -UNIÓN TRANSITORIA, asociación, mutual, etc-:"},{"$f":"IF(MIEMBROS!J121>0,MIEMBROS!J121,\"INCOMPLETO RECHAZAR\")","v":"INCOMPLETO RECHAZAR"},284]
[{"$f":"+MIEMBROS!G115","v":"c MIEMBRO PJ"},{"$f":"+MIEMBROS!H115","v":0},{"$f":"+MIEMBROS!H115","v":0},{"$f":"+MIEMBROS!I115","v":"CEL/TEL :"},{"$f":"IF(MIEMBROS!J115>0,MIEMBROS!J115,\"INCOMPLETO RECHAZAR\")","v":"INCOMPLETO RECHAZAR"},285]
[{"$f":"+MIEMBROS!G136","v":"c MIEMBRO PJ"},{"$f":"+MIEMBROS!H136","v":0},{"$f":"+MIEMBROS!H136","v":0},{"$f":"+MIEMBROS!I136","v":"DATOS DE RESOLUCIÓN Y FECHA DE INSCRIPCIÓN:"},{"$f":"IF(MIEMBROS!J136>0,MIEMBROS!J136,\"INCOMPLETO RECHAZAR\")","v":"INCOMPLETO RECHAZAR"},286]
[{"$f":"+MIEMBROS!G139","v":"c MIEMBRO PJ"},{"$f":"+MIEMBROS!H139","v":0},{"$f":"+MIEMBROS!H139","v":0},{"$f":"+MIEMBROS!I139","v":"DOMICILIO SOCIAL:"},{"$f":"IF(MIEMBROS!J139>0,MIEMBROS!J139,\"INCOMPLETO RECHAZAR\")","v":"INCOMPLETO RECHAZAR"},287]
[{"$f":"+MIEMBROS!G131","v":"d CONTRIB."},{"$f":"+MIEMBROS!H131","v":0},{"$f":"+MIEMBROS!H131","v":0},{"$f":"+MIEMBROS!I131","v":"PARTICIPACIÓN S/FONDO COMÚN OPERATIVO (%):"},{"$f":"IF(MIEMBROS!J131>0,MIEMBROS!J131,\"INCOMPLETO RECHAZAR\")","v":{"$error":"#DIV/0!"}},288]
[{"$f":"+MIEMBROS!G134","v":"c MIEMBRO PJ"},{"$f":"+MIEMBROS!H134","v":0},{"$f":"+MIEMBROS!H134","v":0},{"$f":"+MIEMBROS!I134","v":"TIPO DE PERSONA JCA -UNIÓN TRANSITORIA, asociación, mutual, etc-:"},{"$f":"IF(MIEMBROS!J134>0,MIEMBROS!J134,\"INCOMPLETO RECHAZAR\")","v":"INCOMPLETO RECHAZAR"},289]
[{"$f":"+MIEMBROS!G137","v":"c MIEMBRO PJ"},{"$f":"+MIEMBROS!H137","v":0},{"$f":"+MIEMBROS!H137","v":0},{"$f":"+MIEMBROS!I137","v":"FECHA DE INSCRIPCION:"},{"$f":"IF(MIEMBROS!J137>0,MIEMBROS!J137,\"INCOMPLETO RECHAZAR\")","v":"INCOMPLETO RECHAZAR"},290]
[{"$f":"+MIEMBROS!G135","v":"c MIEMBRO PJ"},{"$f":"+MIEMBROS!H135","v":0},{"$f":"+MIEMBROS!H135","v":0},{"$f":"+MIEMBROS!I135","v":"ORGANISMO /s DONDE SE INSCRIBIÓ CONSTITUCIÓN (INDICAR LOCALIDAD/PCIA DEL ORG) -si no se inscribió poner: NO INSCRIPTO/A:"},{"$f":"IF(MIEMBROS!J135>0,MIEMBROS!J135,\"INCOMPLETO RECHAZAR\")","v":"INCOMPLETO RECHAZAR"},291]
[{"$f":"+MIEMBROS!G140","v":"c MIEMBRO PJ"},{"$f":"+MIEMBROS!H140","v":0},{"$f":"+MIEMBROS!H140","v":0},{"$f":"+MIEMBROS!I140","v":"SEDE SOCIAL:"},{"$f":"IF(MIEMBROS!J140>0,MIEMBROS!J140,\"INCOMPLETO RECHAZAR\")","v":"INCOMPLETO RECHAZAR"},293]
[{"$f":"+MIEMBROS!G133","v":"c MIEMBRO PJ"},{"$f":"+MIEMBROS!H133","v":0},{"$f":"+MIEMBROS!H133","v":0},{"$f":"+MIEMBROS!I133","v":"CUIT –sin puntos ni barras-:"},{"$f":"IF(MIEMBROS!J133>0,MIEMBROS!J133,\"INCOMPLETO RECHAZAR\")","v":"INCOMPLETO RECHAZAR"},294]
[{"$f":"+MIEMBROS!G138","v":"c MIEMBRO PJ"},{"$f":"+MIEMBROS!H138","v":0},{"$f":"+MIEMBROS!H138","v":0},{"$f":"+MIEMBROS!I138","v":"APELLIDO/S, NOMBRE/S,  DNI Y CARGO DE CADA MIEMBRO DE SU ADMINISTRACIÓN:"},{"$f":"IF(MIEMBROS!J138>0,MIEMBROS!J138,\"INCOMPLETO RECHAZAR\")","v":"INCOMPLETO RECHAZAR"},295]
[{"$f":"+MIEMBROS!G132","v":"c MIEMBRO PJ"},{"$f":"+MIEMBROS!H132","v":0},{"$f":"+MIEMBROS!H132","v":0},{"$f":"+MIEMBROS!I132","v":"NOTA/OBSERVACIÓN -en mayúscula-:"},{"$f":"IF(MIEMBROS!J132>0,MIEMBROS!J132,\"INCOMPLETO RECHAZAR\")","v":"INCOMPLETO RECHAZAR"},296]
[{"$f":"+MIEMBROS!A47","v":"g CONTRIB."},{"$f":"+MIEMBROS!B47","v":0},{"$f":"+MIEMBROS!C47","v":0},{"$f":"+MIEMBROS!D47","v":"CONTRIBUCIÓN -EN PESOS U OTRA MONEDA-:"},{"$f":"IF(MIEMBROS!E47>0,MIEMBROS!E47,\"INCOMPLETO RECHAZAR\")","v":"INCOMPLETO RECHAZAR"},320]
[{"$f":"+MIEMBROS!A69","v":"c MIEMBRO PH"},{"$f":"+MIEMBROS!B69","v":0},{"$f":"+MIEMBROS!C69","v":0},{"$f":"+MIEMBROS!D69","v":"NOTA/OBSERVACIÓN -en mayúscula-:"},{"$f":"IF(MIEMBROS!E69>0,MIEMBROS!E69,\"INCOMPLETO RECHAZAR\")","v":"INCOMPLETO RECHAZAR"},321]
[{"$f":"+MIEMBROS!A91","v":"c MIEMBRO PH"},{"$f":"+MIEMBROS!B91","v":0},{"$f":"+MIEMBROS!C91","v":0},{"$f":"+MIEMBROS!D91","v":"LUGAR DE NACIMIENTO:"},{"$f":"IF(MIEMBROS!E91>0,MIEMBROS!E91,\"INCOMPLETO RECHAZAR\")","v":"INCOMPLETO RECHAZAR"},322]
[{"$f":"+MIEMBROS!A113","v":"c MIEMBRO PH"},{"$f":"+MIEMBROS!B113","v":0},{"$f":"+MIEMBROS!C113","v":0},{"$f":"+MIEMBROS!D113","v":"CEL/TEL :"},{"$f":"IF(MIEMBROS!E113>0,MIEMBROS!E113,\"INCOMPLETO RECHAZAR\")","v":"INCOMPLETO RECHAZAR"},323]
[{"$f":"+MIEMBROS!A135","v":"c MIEMBRO PH"},{"$f":"+MIEMBROS!B135","v":0},{"$f":"+MIEMBROS!C135","v":0},{"$f":"+MIEMBROS!D135","v":""},{"$f":"IF(MIEMBROS!E135>0,MIEMBROS!E135,\"INCOMPLETO RECHAZAR\")","v":"INCOMPLETO RECHAZAR"},324]
[{"$f":"+MIEMBROS!A157","v":"i ORG. REP. LEGAL/ ADM."},{"$f":"+MIEMBROS!B157","v":0},{"$f":"+MIEMBROS!C157","v":0},{"$f":"+MIEMBROS!D157","v":"NOMBRE CARGO REP. LEGAL/ ADMINISTRACIÓN QUE OCUPA:"},{"$f":"IF(MIEMBROS!E157>0,MIEMBROS!E157,\"INCOMPLETO RECHAZAR\")","v":"INCOMPLETO RECHAZAR"},325]
[{"$f":"+MIEMBROS!A179","v":"c MIEMBRO PH"},{"$f":"+MIEMBROS!B179","v":0},{"$f":"+MIEMBROS!C179","v":0},{"$f":"+MIEMBROS!D179","v":"CUIT/CUIL –sin puntos ni barras-:"},{"$f":"IF(MIEMBROS!E179>0,MIEMBROS!E179,\"INCOMPLETO RECHAZAR\")","v":"INCOMPLETO RECHAZAR"},326]
[{"$f":"+MIEMBROS!A201","v":"c MIEMBRO PH"},{"$f":"+MIEMBROS!B201","v":0},{"$f":"+MIEMBROS!C201","v":0},{"$f":"+MIEMBROS!D201","v":"PROFESIÓN/OFICIO:"},{"$f":"IF(MIEMBROS!E201>0,MIEMBROS!E201,\"INCOMPLETO RECHAZAR\")","v":"INCOMPLETO RECHAZAR"},327]
[{"$f":"+MIEMBROS!A223","v":"c MIEMBRO PH"},{"$f":"+MIEMBROS!B223","v":0},{"$f":"+MIEMBROS!C223","v":0},{"$f":"+MIEMBROS!D223","v":"ESTADO CIVIL:"},{"$f":"IF(MIEMBROS!E223>0,MIEMBROS!E223,\"INCOMPLETO RECHAZAR\")","v":"INCOMPLETO RECHAZAR"},328]
[{"$f":"+MIEMBROS!A245","v":"g CONTRIB."},{"$f":"+MIEMBROS!B245","v":0},{"$f":"+MIEMBROS!C245","v":0},{"$f":"+MIEMBROS!D245","v":"CONTRIBUCIÓN -EN PESOS U OTRA MONEDA-:"},{"$f":"IF(MIEMBROS!E245>0,MIEMBROS!E245,\"INCOMPLETO RECHAZAR\")","v":"INCOMPLETO RECHAZAR"},329]
[{"$f":"+MIEMBROS!A267","v":"c MIEMBRO PH"},{"$f":"+MIEMBROS!B267","v":0},{"$f":"+MIEMBROS!C267","v":0},{"$f":"+MIEMBROS!D267","v":"NOTA/OBSERVACIÓN -en mayúscula-:"},{"$f":"IF(MIEMBROS!E267>0,MIEMBROS!E267,\"INCOMPLETO RECHAZAR\")","v":"INCOMPLETO RECHAZAR"},330]
[{"$f":"+MIEMBROS!G26","v":"d CONTRIB."},{"$f":"+MIEMBROS!H26","v":0},{"$f":"+MIEMBROS!H26","v":0},{"$f":"+MIEMBROS!I26","v":"CONTRIBUCIÓN -EN PESOS U OTRA MONEDA-:"},{"$f":"IF(MIEMBROS!J26>0,MIEMBROS!J26,\"INCOMPLETO RECHAZAR\")","v":"INCOMPLETO RECHAZAR"},333]
[{"$f":"+MIEMBROS!G39","v":"d CONTRIB."},{"$f":"+MIEMBROS!H39","v":0},{"$f":"+MIEMBROS!H39","v":0},{"$f":"+MIEMBROS!I39","v":"CONTRIBUCIÓN -EN PESOS U OTRA MONEDA-:"},{"$f":"IF(MIEMBROS!J39>0,MIEMBROS!J39,\"INCOMPLETO RECHAZAR\")","v":"INCOMPLETO RECHAZAR"},334]
[{"$f":"+MIEMBROS!G56","v":"c MIEMBRO PJ"},{"$f":"+MIEMBROS!H56","v":0},{"$f":"+MIEMBROS!H56","v":0},{"$f":"+MIEMBROS!I56","v":"TIPO DE PERSONA JCA -UNIÓN TRANSITORIA, asociación, mutual, etc-:"},{"$f":"IF(MIEMBROS!J56>0,MIEMBROS!J56,\"INCOMPLETO RECHAZAR\")","v":"INCOMPLETO RECHAZAR"},335]
[{"$f":"+MIEMBROS!G73","v":"c MIEMBRO PJ"},{"$f":"+MIEMBROS!H73","v":0},{"$f":"+MIEMBROS!H73","v":0},{"$f":"+MIEMBROS!I73","v":"APELLIDO/S, NOMBRE/S,  DNI Y CARGO DE CADA MIEMBRO DE SU ADMINISTRACIÓN:"},{"$f":"IF(MIEMBROS!J73>0,MIEMBROS!J73,\"INCOMPLETO RECHAZAR\")","v":"INCOMPLETO RECHAZAR"},336]
[{"$f":"+MIEMBROS!G90","v":"c MIEMBRO PJ"},{"$f":"+MIEMBROS!H90","v":0},{"$f":"+MIEMBROS!H90","v":0},{"$f":"+MIEMBROS!I90","v":"OBJETO PRINCIPAL (EN FORMA RESUMIDA):"},{"$f":"IF(MIEMBROS!J90>0,MIEMBROS!J90,\"INCOMPLETO RECHAZAR\")","v":"INCOMPLETO RECHAZAR"},337]
[{"$f":"+MIEMBROS!G107","v":"c MIEMBRO PJ"},{"$f":"+MIEMBROS!H107","v":0},{"$f":"+MIEMBROS!H107","v":0},{"$f":"+MIEMBROS!I107","v":"CUIT –sin puntos ni barras-:"},{"$f":"IF(MIEMBROS!J107>0,MIEMBROS!J107,\"INCOMPLETO RECHAZAR\")","v":"INCOMPLETO RECHAZAR"},338]
[{"$f":"+MIEMBROS!G124","v":"c MIEMBRO PJ"},{"$f":"+MIEMBROS!H124","v":0},{"$f":"+MIEMBROS!H124","v":0},{"$f":"+MIEMBROS!I124","v":"FECHA DE INSCRIPCION:"},{"$f":"IF(MIEMBROS!J124>0,MIEMBROS!J124,\"INCOMPLETO RECHAZAR\")","v":"INCOMPLETO RECHAZAR"},339]
[{"$f":"+MIEMBROS!G141","v":"c MIEMBRO PJ"},{"$f":"+MIEMBROS!H141","v":0},{"$f":"+MIEMBROS!H141","v":0},{"$f":"+MIEMBROS!I141","v":"CEL/TEL :"},{"$f":"IF(MIEMBROS!J141>0,MIEMBROS!J141,\"INCOMPLETO RECHAZAR\")","v":"INCOMPLETO RECHAZAR"},340]
[{"$f":"+MIEMBROS!A50","v":"j ORG. FISCALIZ."},{"$f":"+MIEMBROS!B50","v":0},{"$f":"+MIEMBROS!C50","v":0},{"$f":"+MIEMBROS!D50","v":"NOMBRE CARGO FISCALIZACIÓN QUE OCUPA:"},{"$f":"IF(MIEMBROS!E50>0,MIEMBROS!E50,\"INCOMPLETO RECHAZAR\")","v":"INCOMPLETO RECHAZAR"},345]
[{"$f":"+MIEMBROS!A72","v":"c MIEMBRO PH"},{"$f":"+MIEMBROS!B72","v":0},{"$f":"+MIEMBROS!C72","v":0},{"$f":"+MIEMBROS!D72","v":"FECHA DE NACIMIENTO –dd/mm/aa-:"},{"$f":"IF(MIEMBROS!E72>0,MIEMBROS!E72,\"INCOMPLETO RECHAZAR\")","v":"INCOMPLETO RECHAZAR"},346]
[{"$f":"+MIEMBROS!A94","v":"c MIEMBRO PH"},{"$f":"+MIEMBROS!B94","v":0},{"$f":"+MIEMBROS!C94","v":0},{"$f":"+MIEMBROS!D94","v":"DOMICILIO REAL:"},{"$f":"IF(MIEMBROS!E94>0,MIEMBROS!E94,\"INCOMPLETO RECHAZAR\")","v":"INCOMPLETO RECHAZAR"},347]
[{"$f":"+MIEMBROS!A116","v":"c MIEMBRO PH"},{"$f":"+MIEMBROS!B116","v":0},{"$f":"+MIEMBROS!C116","v":0},{"$f":"+MIEMBROS!D116","v":""},{"$f":"IF(MIEMBROS!E116>0,MIEMBROS!E116,\"INCOMPLETO RECHAZAR\")","v":"INCOMPLETO RECHAZAR"},348]
[{"$f":"+MIEMBROS!A138","v":"f PARTICIPACION"},{"$f":"+MIEMBROS!B138","v":0},{"$f":"+MIEMBROS!C138","v":0},{"$f":"+MIEMBROS!D138","v":"PARTICIPACIÓN S/FONDO COMÚN OPERATIVO (%):"},{"$f":"IF(MIEMBROS!E138>0,MIEMBROS!E138,\"INCOMPLETO RECHAZAR\")","v":{"$error":"#DIV/0!"}},349]
[{"$f":"+MIEMBROS!A160","v":"c MIEMBRO PH"},{"$f":"+MIEMBROS!B160","v":0},{"$f":"+MIEMBROS!C160","v":0},{"$f":"+MIEMBROS!D160","v":"DOC. IDENTIDAD –sin puntos-:"},{"$f":"IF(MIEMBROS!E160>0,MIEMBROS!E160,\"INCOMPLETO RECHAZAR\")","v":"INCOMPLETO RECHAZAR"},350]
[{"$f":"+MIEMBROS!A182","v":"c MIEMBRO PH"},{"$f":"+MIEMBROS!B182","v":0},{"$f":"+MIEMBROS!C182","v":0},{"$f":"+MIEMBROS!D182","v":"NACIONALIDAD:"},{"$f":"IF(MIEMBROS!E182>0,MIEMBROS!E182,\"INCOMPLETO RECHAZAR\")","v":"INCOMPLETO RECHAZAR"},351]
[{"$f":"+MIEMBROS!A204","v":"c MIEMBRO PH"},{"$f":"+MIEMBROS!B204","v":0},{"$f":"+MIEMBROS!C204","v":0},{"$f":"+MIEMBROS!D204","v":"EMAIL:"},{"$f":"IF(MIEMBROS!E204>0,MIEMBROS!E204,\"INCOMPLETO RECHAZAR\")","v":"INCOMPLETO RECHAZAR"},352]
[{"$f":"+MIEMBROS!A226","v":"c MIEMBRO PH"},{"$f":"+MIEMBROS!B226","v":0},{"$f":"+MIEMBROS!C226","v":0},{"$f":"+MIEMBROS!D226","v":""},{"$f":"IF(MIEMBROS!E226>0,MIEMBROS!E226,\"INCOMPLETO RECHAZAR\")","v":"INCOMPLETO RECHAZAR"},353]
[{"$f":"+MIEMBROS!A248","v":"j ORG. FISCALIZ."},{"$f":"+MIEMBROS!B248","v":0},{"$f":"+MIEMBROS!C248","v":0},{"$f":"+MIEMBROS!D248","v":"NOMBRE CARGO FISCALIZACIÓN QUE OCUPA:"},{"$f":"IF(MIEMBROS!E248>0,MIEMBROS!E248,\"INCOMPLETO RECHAZAR\")","v":"INCOMPLETO RECHAZAR"},354]
[{"$f":"+MIEMBROS!G42","v":"c MIEMBRO PJ"},{"$f":"+MIEMBROS!H42","v":0},{"$f":"+MIEMBROS!H42","v":0},{"$f":"+MIEMBROS!I42","v":"CUIT –sin puntos ni barras-:"},{"$f":"IF(MIEMBROS!J42>0,MIEMBROS!J42,\"INCOMPLETO RECHAZAR\")","v":"INCOMPLETO RECHAZAR"},359]
[{"$f":"+MIEMBROS!G59","v":"c MIEMBRO PJ"},{"$f":"+MIEMBROS!H59","v":0},{"$f":"+MIEMBROS!H59","v":0},{"$f":"+MIEMBROS!I59","v":"FECHA DE INSCRIPCION:"},{"$f":"IF(MIEMBROS!J59>0,MIEMBROS!J59,\"INCOMPLETO RECHAZAR\")","v":"INCOMPLETO RECHAZAR"},360]
[{"$f":"+MIEMBROS!G76","v":"c MIEMBRO PJ"},{"$f":"+MIEMBROS!H76","v":0},{"$f":"+MIEMBROS!H76","v":0},{"$f":"+MIEMBROS!I76","v":"CEL/TEL :"},{"$f":"IF(MIEMBROS!J76>0,MIEMBROS!J76,\"INCOMPLETO RECHAZAR\")","v":"INCOMPLETO RECHAZAR"},361]
[{"$f":"+MIEMBROS!G93","v":"c MIEMBRO PJ"},{"$f":"+MIEMBROS!H93","v":0},{"$f":"+MIEMBROS!H93","v":0},{"$f":"+MIEMBROS!I93","v":"NOTA/OBSERVACIÓN -en mayúscula-:"},{"$f":"IF(MIEMBROS!J93>0,MIEMBROS!J93,\"INCOMPLETO RECHAZAR\")","v":"INCOMPLETO RECHAZAR"},362]
[{"$f":"+MIEMBROS!G110","v":"c MIEMBRO PJ"},{"$f":"+MIEMBROS!H110","v":0},{"$f":"+MIEMBROS!H110","v":0},{"$f":"+MIEMBROS!I110","v":"DATOS DE RESOLUCIÓN Y FECHA DE INSCRIPCIÓN:"},{"$f":"IF(MIEMBROS!J110>0,MIEMBROS!J110,\"INCOMPLETO RECHAZAR\")","v":"INCOMPLETO RECHAZAR"},363]
[{"$f":"+MIEMBROS!G127","v":"c MIEMBRO PJ"},{"$f":"+MIEMBROS!H127","v":0},{"$f":"+MIEMBROS!H127","v":0},{"$f":"+MIEMBROS!I127","v":"SEDE SOCIAL:"},{"$f":"IF(MIEMBROS!J127>0,MIEMBROS!J127,\"INCOMPLETO RECHAZAR\")","v":"INCOMPLETO RECHAZAR"},364]
[{"$f":"+MIEMBROS!G144","v":"d CONTRIB."},{"$f":"+MIEMBROS!H144","v":0},{"$f":"+MIEMBROS!H144","v":0},{"$f":"+MIEMBROS!I144","v":"PARTICIPACIÓN S/FONDO COMÚN OPERATIVO (%):"},{"$f":"IF(MIEMBROS!J144>0,MIEMBROS!J144,\"INCOMPLETO RECHAZAR\")","v":{"$error":"#DIV/0!"}},365]
[{"$f":"+'DATOS UT'!A32","v":"ba UNIÓN TRANSITORIA"},{"$f":"UPPER('DATOS UT'!B32)","v":"0"},{"$f":"UPPER('DATOS UT'!C32)","v":"0"},{"$f":"+'DATOS UT'!D32","v":"FONDO COMÚN OPERATIVO -en pesos o moneda convenida-:"},{"$f":"IF('DATOS UT'!E32>0,'DATOS UT'!E32,\"INCOMPLETO RECHAZAR\")","v":"INCOMPLETO RECHAZAR"},368]
[{"$f":"+MIEMBROS!A30","v":"f PARTICIPACION"},{"$f":"+MIEMBROS!B30","v":0},{"$f":"+MIEMBROS!C30","v":0},{"$f":"+MIEMBROS!D30","v":"PARTICIPACIÓN S/FONDO COMÚN OPERATIVO (%):"},{"$f":"IF(MIEMBROS!E30>0,MIEMBROS!E30,\"INCOMPLETO RECHAZAR\")","v":{"$error":"#DIV/0!"}},369]
[{"$f":"+MIEMBROS!A52","v":"c MIEMBRO PH"},{"$f":"+MIEMBROS!B52","v":0},{"$f":"+MIEMBROS!C52","v":0},{"$f":"+MIEMBROS!D52","v":"DOC. IDENTIDAD –sin puntos-:"},{"$f":"IF(MIEMBROS!E52>0,MIEMBROS!E52,\"INCOMPLETO RECHAZAR\")","v":"INCOMPLETO RECHAZAR"},370]
[{"$f":"+MIEMBROS!A74","v":"c MIEMBRO PH"},{"$f":"+MIEMBROS!B74","v":0},{"$f":"+MIEMBROS!C74","v":0},{"$f":"+MIEMBROS!D74","v":"NACIONALIDAD:"},{"$f":"IF(MIEMBROS!E74>0,MIEMBROS!E74,\"INCOMPLETO RECHAZAR\")","v":"INCOMPLETO RECHAZAR"},371]
[{"$f":"+MIEMBROS!A96","v":"c MIEMBRO PH"},{"$f":"+MIEMBROS!B96","v":0},{"$f":"+MIEMBROS!C96","v":0},{"$f":"+MIEMBROS!D96","v":"EMAIL:"},{"$f":"IF(MIEMBROS!E96>0,MIEMBROS!E96,\"INCOMPLETO RECHAZAR\")","v":"INCOMPLETO RECHAZAR"},372]
[{"$f":"+MIEMBROS!A118","v":"c MIEMBRO PH"},{"$f":"+MIEMBROS!B118","v":0},{"$f":"+MIEMBROS!C118","v":0},{"$f":"+MIEMBROS!D118","v":""},{"$f":"IF(MIEMBROS!E118>0,MIEMBROS!E118,\"INCOMPLETO RECHAZAR\")","v":"INCOMPLETO RECHAZAR"},373]
[{"$f":"+MIEMBROS!A140","v":"j ORG. FISCALIZ."},{"$f":"+MIEMBROS!B140","v":0},{"$f":"+MIEMBROS!C140","v":0},{"$f":"+MIEMBROS!D140","v":"NOMBRE CARGO FISCALIZACIÓN QUE OCUPA:"},{"$f":"IF(MIEMBROS!E140>0,MIEMBROS!E140,\"INCOMPLETO RECHAZAR\")","v":"INCOMPLETO RECHAZAR"},374]
[{"$f":"+MIEMBROS!A162","v":"c MIEMBRO PH"},{"$f":"+MIEMBROS!B162","v":0},{"$f":"+MIEMBROS!C162","v":0},{"$f":"+MIEMBROS!D162","v":"FECHA DE NACIMIENTO –dd/mm/aa-:"},{"$f":"IF(MIEMBROS!E162>0,MIEMBROS!E162,\"INCOMPLETO RECHAZAR\")","v":"INCOMPLETO RECHAZAR"},375]
[{"$f":"+MIEMBROS!A184","v":"c MIEMBRO PH"},{"$f":"+MIEMBROS!B184","v":0},{"$f":"+MIEMBROS!C184","v":0},{"$f":"+MIEMBROS!D184","v":"DOMICILIO REAL:"},{"$f":"IF(MIEMBROS!E184>0,MIEMBROS!E184,\"INCOMPLETO RECHAZAR\")","v":"INCOMPLETO RECHAZAR"},376]
[{"$f":"+MIEMBROS!A206","v":"c MIEMBRO PH"},{"$f":"+MIEMBROS!B206","v":0},{"$f":"+MIEMBROS!C206","v":0},{"$f":"+MIEMBROS!D206","v":""},{"$f":"IF(MIEMBROS!E206>0,MIEMBROS!E206,\"INCOMPLETO RECHAZAR\")","v":"INCOMPLETO RECHAZAR"},377]
[{"$f":"+MIEMBROS!A228","v":"f PARTICIPACION"},{"$f":"+MIEMBROS!B228","v":0},{"$f":"+MIEMBROS!C228","v":0},{"$f":"+MIEMBROS!D228","v":"PARTICIPACIÓN S/FONDO COMÚN OPERATIVO (%):"},{"$f":"IF(MIEMBROS!E228>0,MIEMBROS!E228,\"INCOMPLETO RECHAZAR\")","v":{"$error":"#DIV/0!"}},378]
[{"$f":"+MIEMBROS!A250","v":"c MIEMBRO PH"},{"$f":"+MIEMBROS!B250","v":0},{"$f":"+MIEMBROS!C250","v":0},{"$f":"+MIEMBROS!D250","v":"DOC. IDENTIDAD –sin puntos-:"},{"$f":"IF(MIEMBROS!E250>0,MIEMBROS!E250,\"INCOMPLETO RECHAZAR\")","v":"INCOMPLETO RECHAZAR"},379]
[{"$f":"+MIEMBROS!G44","v":"c MIEMBRO PJ"},{"$f":"+MIEMBROS!H44","v":0},{"$f":"+MIEMBROS!H44","v":0},{"$f":"+MIEMBROS!I44","v":"ORGANISMO /s DONDE SE INSCRIBIÓ CONSTITUCIÓN (INDICAR LOCALIDAD/PCIA DEL ORG) -si no se inscribió poner: NO INSCRIPTO/A:"},{"$f":"IF(MIEMBROS!J44>0,MIEMBROS!J44,\"INCOMPLETO RECHAZAR\")","v":"INCOMPLETO RECHAZAR"},384]
[{"$f":"+MIEMBROS!G61","v":"c MIEMBRO PJ"},{"$f":"+MIEMBROS!H61","v":0},{"$f":"+MIEMBROS!H61","v":0},{"$f":"+MIEMBROS!I61","v":"DOMICILIO SOCIAL:"},{"$f":"IF(MIEMBROS!J61>0,MIEMBROS!J61,\"INCOMPLETO RECHAZAR\")","v":"INCOMPLETO RECHAZAR"},385]
[{"$f":"+MIEMBROS!G78","v":"d CONTRIB."},{"$f":"+MIEMBROS!H78","v":0},{"$f":"+MIEMBROS!H78","v":0},{"$f":"+MIEMBROS!I78","v":"CONTRIBUCIÓN -EN PESOS U OTRA MONEDA-:"},{"$f":"IF(MIEMBROS!J78>0,MIEMBROS!J78,\"INCOMPLETO RECHAZAR\")","v":"INCOMPLETO RECHAZAR"},386]
[{"$f":"+MIEMBROS!G95","v":"c MIEMBRO PJ"},{"$f":"+MIEMBROS!H95","v":0},{"$f":"+MIEMBROS!H95","v":0},{"$f":"+MIEMBROS!I95","v":"TIPO DE PERSONA JCA -UNIÓN TRANSITORIA, asociación, mutual, etc-:"},{"$f":"IF(MIEMBROS!J95>0,MIEMBROS!J95,\"INCOMPLETO RECHAZAR\")","v":"INCOMPLETO RECHAZAR"},387]
[{"$f":"+MIEMBROS!G112","v":"c MIEMBRO PJ"},{"$f":"+MIEMBROS!H112","v":0},{"$f":"+MIEMBROS!H112","v":0},{"$f":"+MIEMBROS!I112","v":"APELLIDO/S, NOMBRE/S,  DNI Y CARGO DE CADA MIEMBRO DE SU ADMINISTRACIÓN:"},{"$f":"IF(MIEMBROS!J112>0,MIEMBROS!J112,\"INCOMPLETO RECHAZAR\")","v":"INCOMPLETO RECHAZAR"},388]
[{"$f":"+MIEMBROS!G129","v":"c MIEMBRO PJ"},{"$f":"+MIEMBROS!H129","v":0},{"$f":"+MIEMBROS!H129","v":0},{"$f":"+MIEMBROS!I129","v":"OBJETO PRINCIPAL (EN FORMA RESUMIDA):"},{"$f":"IF(MIEMBROS!J129>0,MIEMBROS!J129,\"INCOMPLETO RECHAZAR\")","v":"INCOMPLETO RECHAZAR"},389]
[{"$f":"+MIEMBROS!G27","v":"d CONTRIB."},{"$f":"+MIEMBROS!H27","v":0},{"$f":"+MIEMBROS!H27","v":0},{"$f":"+MIEMBROS!I27","v":"PARTICIPACIÓN S/FONDO COMÚN OPERATIVO (%):"},{"$f":"IF(MIEMBROS!J27>0,MIEMBROS!J27,\"INCOMPLETO RECHAZAR\")","v":{"$error":"#DIV/0!"}},393]
[{"$f":"+MIEMBROS!G40","v":"d CONTRIB."},{"$f":"+MIEMBROS!H40","v":0},{"$f":"+MIEMBROS!H40","v":0},{"$f":"+MIEMBROS!I40","v":"PARTICIPACIÓN S/FONDO COMÚN OPERATIVO (%):"},{"$f":"IF(MIEMBROS!J40>0,MIEMBROS!J40,\"INCOMPLETO RECHAZAR\")","v":{"$error":"#DIV/0!"}},394]
[{"$f":"+MIEMBROS!G57","v":"c MIEMBRO PJ"},{"$f":"+MIEMBROS!H57","v":0},{"$f":"+MIEMBROS!H57","v":0},{"$f":"+MIEMBROS!I57","v":"ORGANISMO /s DONDE SE INSCRIBIÓ CONSTITUCIÓN (INDICAR LOCALIDAD/PCIA DEL ORG) -si no se inscribió poner: NO INSCRIPTO/A:"},{"$f":"IF(MIEMBROS!J57>0,MIEMBROS!J57,\"INCOMPLETO RECHAZAR\")","v":"INCOMPLETO RECHAZAR"},395]
[{"$f":"+MIEMBROS!G74","v":"c MIEMBRO PJ"},{"$f":"+MIEMBROS!H74","v":0},{"$f":"+MIEMBROS!H74","v":0},{"$f":"+MIEMBROS!I74","v":"DOMICILIO SOCIAL:"},{"$f":"IF(MIEMBROS!J74>0,MIEMBROS!J74,\"INCOMPLETO RECHAZAR\")","v":"INCOMPLETO RECHAZAR"},396]
[{"$f":"+MIEMBROS!G91","v":"d CONTRIB."},{"$f":"+MIEMBROS!H91","v":0},{"$f":"+MIEMBROS!H91","v":0},{"$f":"+MIEMBROS!I91","v":"CONTRIBUCIÓN -EN PESOS U OTRA MONEDA-:"},{"$f":"IF(MIEMBROS!J91>0,MIEMBROS!J91,\"INCOMPLETO RECHAZAR\")","v":"INCOMPLETO RECHAZAR"},397]
[{"$f":"+MIEMBROS!G108","v":"c MIEMBRO PJ"},{"$f":"+MIEMBROS!H108","v":0},{"$f":"+MIEMBROS!H108","v":0},{"$f":"+MIEMBROS!I108","v":"TIPO DE PERSONA JCA -UNIÓN TRANSITORIA, asociación, mutual, etc-:"},{"$f":"IF(MIEMBROS!J108>0,MIEMBROS!J108,\"INCOMPLETO RECHAZAR\")","v":"INCOMPLETO RECHAZAR"},398]
[{"$f":"+MIEMBROS!G125","v":"c MIEMBRO PJ"},{"$f":"+MIEMBROS!H125","v":0},{"$f":"+MIEMBROS!H125","v":0},{"$f":"+MIEMBROS!I125","v":"APELLIDO/S, NOMBRE/S,  DNI Y CARGO DE CADA MIEMBRO DE SU ADMINISTRACIÓN:"},{"$f":"IF(MIEMBROS!J125>0,MIEMBROS!J125,\"INCOMPLETO RECHAZAR\")","v":"INCOMPLETO RECHAZAR"},399]
[{"$f":"+MIEMBROS!G142","v":"c MIEMBRO PJ"},{"$f":"+MIEMBROS!H142","v":0},{"$f":"+MIEMBROS!H142","v":0},{"$f":"+MIEMBROS!I142","v":"OBJETO PRINCIPAL (EN FORMA RESUMIDA):"},{"$f":"IF(MIEMBROS!J142>0,MIEMBROS!J142,\"INCOMPLETO RECHAZAR\")","v":"INCOMPLETO RECHAZAR"},400]
[{"$f":"+MIEMBROS!A29","v":"g CONTRIB."},{"$f":"+MIEMBROS!B29","v":0},{"$f":"+MIEMBROS!C29","v":0},{"$f":"+MIEMBROS!D29","v":"CONTRIBUCIÓN -EN PESOS U OTRA MONEDA-:"},{"$f":"IF(MIEMBROS!E29>0,MIEMBROS!E29,\"INCOMPLETO RECHAZAR\")","v":"INCOMPLETO RECHAZAR"},403]
[{"$f":"+MIEMBROS!A48","v":"f PARTICIPACION"},{"$f":"+MIEMBROS!B48","v":0},{"$f":"+MIEMBROS!C48","v":0},{"$f":"+MIEMBROS!D48","v":"PARTICIPACIÓN S/FONDO COMÚN OPERATIVO (%):"},{"$f":"IF(MIEMBROS!E48>0,MIEMBROS!E48,\"INCOMPLETO RECHAZAR\")","v":{"$error":"#DIV/0!"}},404]
[{"$f":"+MIEMBROS!A70","v":"c MIEMBRO PH"},{"$f":"+MIEMBROS!B70","v":0},{"$f":"+MIEMBROS!C70","v":0},{"$f":"+MIEMBROS!D70","v":"DOC. IDENTIDAD –sin puntos-:"},{"$f":"IF(MIEMBROS!E70>0,MIEMBROS!E70,\"INCOMPLETO RECHAZAR\")","v":"INCOMPLETO RECHAZAR"},405]
[{"$f":"+MIEMBROS!A92","v":"c MIEMBRO PH"},{"$f":"+MIEMBROS!B92","v":0},{"$f":"+MIEMBROS!C92","v":0},{"$f":"+MIEMBROS!D92","v":"NACIONALIDAD:"},{"$f":"IF(MIEMBROS!E92>0,MIEMBROS!E92,\"INCOMPLETO RECHAZAR\")","v":"INCOMPLETO RECHAZAR"},406]
[{"$f":"+MIEMBROS!A114","v":"c MIEMBRO PH"},{"$f":"+MIEMBROS!B114","v":0},{"$f":"+MIEMBROS!C114","v":0},{"$f":"+MIEMBROS!D114","v":"EMAIL:"},{"$f":"IF(MIEMBROS!E114>0,MIEMBROS!E114,\"INCOMPLETO RECHAZAR\")","v":"INCOMPLETO RECHAZAR"},407]
[{"$f":"+MIEMBROS!A136","v":"c MIEMBRO PH"},{"$f":"+MIEMBROS!B136","v":0},{"$f":"+MIEMBROS!C136","v":0},{"$f":"+MIEMBROS!D136","v":""},{"$f":"IF(MIEMBROS!E136>0,MIEMBROS!E136,\"INCOMPLETO RECHAZAR\")","v":"INCOMPLETO RECHAZAR"},408]
[{"$f":"+MIEMBROS!A158","v":"j ORG. FISCALIZ."},{"$f":"+MIEMBROS!B158","v":0},{"$f":"+MIEMBROS!C158","v":0},{"$f":"+MIEMBROS!D158","v":"NOMBRE CARGO FISCALIZACIÓN QUE OCUPA:"},{"$f":"IF(MIEMBROS!E158>0,MIEMBROS!E158,\"INCOMPLETO RECHAZAR\")","v":"INCOMPLETO RECHAZAR"},409]
[{"$f":"+MIEMBROS!A180","v":"c MIEMBRO PH"},{"$f":"+MIEMBROS!B180","v":0},{"$f":"+MIEMBROS!C180","v":0},{"$f":"+MIEMBROS!D180","v":"FECHA DE NACIMIENTO –dd/mm/aa-:"},{"$f":"IF(MIEMBROS!E180>0,MIEMBROS!E180,\"INCOMPLETO RECHAZAR\")","v":"INCOMPLETO RECHAZAR"},410]
[{"$f":"+MIEMBROS!A202","v":"c MIEMBRO PH"},{"$f":"+MIEMBROS!B202","v":0},{"$f":"+MIEMBROS!C202","v":0},{"$f":"+MIEMBROS!D202","v":"DOMICILIO REAL:"},{"$f":"IF(MIEMBROS!E202>0,MIEMBROS!E202,\"INCOMPLETO RECHAZAR\")","v":"INCOMPLETO RECHAZAR"},411]
[{"$f":"+MIEMBROS!A224","v":"c MIEMBRO PH"},{"$f":"+MIEMBROS!B224","v":0},{"$f":"+MIEMBROS!C224","v":0},{"$f":"+MIEMBROS!D224","v":""},{"$f":"IF(MIEMBROS!E224>0,MIEMBROS!E224,\"INCOMPLETO RECHAZAR\")","v":"INCOMPLETO RECHAZAR"},412]
[{"$f":"+MIEMBROS!A246","v":"f PARTICIPACION"},{"$f":"+MIEMBROS!B246","v":0},{"$f":"+MIEMBROS!C246","v":0},{"$f":"+MIEMBROS!D246","v":"PARTICIPACIÓN S/FONDO COMÚN OPERATIVO (%):"},{"$f":"IF(MIEMBROS!E246>0,MIEMBROS!E246,\"INCOMPLETO RECHAZAR\")","v":{"$error":"#DIV/0!"}},413]
[{"$f":"+MIEMBROS!G41","v":"c MIEMBRO PJ"},{"$f":"+MIEMBROS!H41","v":0},{"$f":"+MIEMBROS!H41","v":0},{"$f":"+MIEMBROS!I41","v":"NOTA/OBSERVACIÓN -en mayúscula-:"},{"$f":"IF(MIEMBROS!J41>0,MIEMBROS!J41,\"INCOMPLETO RECHAZAR\")","v":"INCOMPLETO RECHAZAR"},418]
[{"$f":"+MIEMBROS!G58","v":"c MIEMBRO PJ"},{"$f":"+MIEMBROS!H58","v":0},{"$f":"+MIEMBROS!H58","v":0},{"$f":"+MIEMBROS!I58","v":"DATOS DE RESOLUCIÓN Y FECHA DE INSCRIPCIÓN:"},{"$f":"IF(MIEMBROS!J58>0,MIEMBROS!J58,\"INCOMPLETO RECHAZAR\")","v":"INCOMPLETO RECHAZAR"},419]
[{"$f":"+MIEMBROS!G75","v":"c MIEMBRO PJ"},{"$f":"+MIEMBROS!H75","v":0},{"$f":"+MIEMBROS!H75","v":0},{"$f":"+MIEMBROS!I75","v":"SEDE SOCIAL:"},{"$f":"IF(MIEMBROS!J75>0,MIEMBROS!J75,\"INCOMPLETO RECHAZAR\")","v":"INCOMPLETO RECHAZAR"},420]
[{"$f":"+MIEMBROS!G92","v":"d CONTRIB."},{"$f":"+MIEMBROS!H92","v":0},{"$f":"+MIEMBROS!H92","v":0},{"$f":"+MIEMBROS!I92","v":"PARTICIPACIÓN S/FONDO COMÚN OPERATIVO (%):"},{"$f":"IF(MIEMBROS!J92>0,MIEMBROS!J92,\"INCOMPLETO RECHAZAR\")","v":{"$error":"#DIV/0!"}},421]
[{"$f":"+MIEMBROS!G109","v":"c MIEMBRO PJ"},{"$f":"+MIEMBROS!H109","v":0},{"$f":"+MIEMBROS!H109","v":0},{"$f":"+MIEMBROS!I109","v":"ORGANISMO /s DONDE SE INSCRIBIÓ CONSTITUCIÓN (INDICAR LOCALIDAD/PCIA DEL ORG) -si no se inscribió poner: NO INSCRIPTO/A:"},{"$f":"IF(MIEMBROS!J109>0,MIEMBROS!J109,\"INCOMPLETO RECHAZAR\")","v":"INCOMPLETO RECHAZAR"},422]
[{"$f":"+MIEMBROS!G126","v":"c MIEMBRO PJ"},{"$f":"+MIEMBROS!H126","v":0},{"$f":"+MIEMBROS!H126","v":0},{"$f":"+MIEMBROS!I126","v":"DOMICILIO SOCIAL:"},{"$f":"IF(MIEMBROS!J126>0,MIEMBROS!J126,\"INCOMPLETO RECHAZAR\")","v":"INCOMPLETO RECHAZAR"},423]
[{"$f":"+MIEMBROS!G143","v":"d CONTRIB."},{"$f":"+MIEMBROS!H143","v":0},{"$f":"+MIEMBROS!H143","v":0},{"$f":"+MIEMBROS!I143","v":"CONTRIBUCIÓN -EN PESOS U OTRA MONEDA-:"},{"$f":"IF(MIEMBROS!J143>0,MIEMBROS!J143,\"INCOMPLETO RECHAZAR\")","v":"INCOMPLETO RECHAZAR"},424]
[{"$f":"+MIEMBROS!A49","v":"i ORG. REP. LEGAL/ ADM."},{"$f":"+MIEMBROS!B49","v":0},{"$f":"+MIEMBROS!C49","v":0},{"$f":"+MIEMBROS!D49","v":"NOMBRE CARGO REP. LEGAL/ ADMINISTRACIÓN QUE OCUPA:"},{"$f":"IF(MIEMBROS!E49>0,MIEMBROS!E49,\"INCOMPLETO RECHAZAR\")","v":"INCOMPLETO RECHAZAR"},428]
[{"$f":"+MIEMBROS!A71","v":"c MIEMBRO PH"},{"$f":"+MIEMBROS!B71","v":0},{"$f":"+MIEMBROS!C71","v":0},{"$f":"+MIEMBROS!D71","v":"CUIT/CUIL –sin puntos ni barras-:"},{"$f":"IF(MIEMBROS!E71>0,MIEMBROS!E71,\"INCOMPLETO RECHAZAR\")","v":"INCOMPLETO RECHAZAR"},429]
[{"$f":"+MIEMBROS!A93","v":"c MIEMBRO PH"},{"$f":"+MIEMBROS!B93","v":0},{"$f":"+MIEMBROS!C93","v":0},{"$f":"+MIEMBROS!D93","v":"PROFESIÓN/OFICIO:"},{"$f":"IF(MIEMBROS!E93>0,MIEMBROS!E93,\"INCOMPLETO RECHAZAR\")","v":"INCOMPLETO RECHAZAR"},430]
[{"$f":"+MIEMBROS!A115","v":"c MIEMBRO PH"},{"$f":"+MIEMBROS!B115","v":0},{"$f":"+MIEMBROS!C115","v":0},{"$f":"+MIEMBROS!D115","v":"ESTADO CIVIL:"},{"$f":"IF(MIEMBROS!E115>0,MIEMBROS!E115,\"INCOMPLETO RECHAZAR\")","v":"INCOMPLETO RECHAZAR"},431]
[{"$f":"+MIEMBROS!A137","v":"g CONTRIB."},{"$f":"+MIEMBROS!B137","v":0},{"$f":"+MIEMBROS!C137","v":0},{"$f":"+MIEMBROS!D137","v":"CONTRIBUCIÓN -EN PESOS U OTRA MONEDA-:"},{"$f":"IF(MIEMBROS!E137>0,MIEMBROS!E137,\"INCOMPLETO RECHAZAR\")","v":"INCOMPLETO RECHAZAR"},432]
[{"$f":"+MIEMBROS!A159","v":"c MIEMBRO PH"},{"$f":"+MIEMBROS!B159","v":0},{"$f":"+MIEMBROS!C159","v":0},{"$f":"+MIEMBROS!D159","v":"NOTA/OBSERVACIÓN -en mayúscula-:"},{"$f":"IF(MIEMBROS!E159>0,MIEMBROS!E159,\"INCOMPLETO RECHAZAR\")","v":"INCOMPLETO RECHAZAR"},433]
[{"$f":"+MIEMBROS!A181","v":"c MIEMBRO PH"},{"$f":"+MIEMBROS!B181","v":0},{"$f":"+MIEMBROS!C181","v":0},{"$f":"+MIEMBROS!D181","v":"LUGAR DE NACIMIENTO:"},{"$f":"IF(MIEMBROS!E181>0,MIEMBROS!E181,\"INCOMPLETO RECHAZAR\")","v":"INCOMPLETO RECHAZAR"},434]
[{"$f":"+MIEMBROS!A203","v":"c MIEMBRO PH"},{"$f":"+MIEMBROS!B203","v":0},{"$f":"+MIEMBROS!C203","v":0},{"$f":"+MIEMBROS!D203","v":"CEL/TEL :"},{"$f":"IF(MIEMBROS!E203>0,MIEMBROS!E203,\"INCOMPLETO RECHAZAR\")","v":"INCOMPLETO RECHAZAR"},435]
[{"$f":"+MIEMBROS!A225","v":"c MIEMBRO PH"},{"$f":"+MIEMBROS!B225","v":0},{"$f":"+MIEMBROS!C225","v":0},{"$f":"+MIEMBROS!D225","v":""},{"$f":"IF(MIEMBROS!E225>0,MIEMBROS!E225,\"INCOMPLETO RECHAZAR\")","v":"INCOMPLETO RECHAZAR"},436]
[{"$f":"+MIEMBROS!A247","v":"i ORG. REP. LEGAL/ ADM."},{"$f":"+MIEMBROS!B247","v":0},{"$f":"+MIEMBROS!C247","v":0},{"$f":"+MIEMBROS!D247","v":"NOMBRE CARGO REP. LEGAL/ ADMINISTRACIÓN QUE OCUPA:"},{"$f":"IF(MIEMBROS!E247>0,MIEMBROS!E247,\"INCOMPLETO RECHAZAR\")","v":"INCOMPLETO RECHAZAR"},437]
[{"$f":"+MIEMBROS!A51","v":"c MIEMBRO PH"},{"$f":"+MIEMBROS!B51","v":0},{"$f":"+MIEMBROS!C51","v":0},{"$f":"+MIEMBROS!D51","v":"NOTA/OBSERVACIÓN -en mayúscula-:"},{"$f":"IF(MIEMBROS!E51>0,MIEMBROS!E51,\"INCOMPLETO RECHAZAR\")","v":"INCOMPLETO RECHAZAR"},442]
[{"$f":"+MIEMBROS!A73","v":"c MIEMBRO PH"},{"$f":"+MIEMBROS!B73","v":0},{"$f":"+MIEMBROS!C73","v":0},{"$f":"+MIEMBROS!D73","v":"LUGAR DE NACIMIENTO:"},{"$f":"IF(MIEMBROS!E73>0,MIEMBROS!E73,\"INCOMPLETO RECHAZAR\")","v":"INCOMPLETO RECHAZAR"},443]
[{"$f":"+MIEMBROS!A95","v":"c MIEMBRO PH"},{"$f":"+MIEMBROS!B95","v":0},{"$f":"+MIEMBROS!C95","v":0},{"$f":"+MIEMBROS!D95","v":"CEL/TEL :"},{"$f":"IF(MIEMBROS!E95>0,MIEMBROS!E95,\"INCOMPLETO RECHAZAR\")","v":"INCOMPLETO RECHAZAR"},444]
[{"$f":"+MIEMBROS!A117","v":"c MIEMBRO PH"},{"$f":"+MIEMBROS!B117","v":0},{"$f":"+MIEMBROS!C117","v":0},{"$f":"+MIEMBROS!D117","v":""},{"$f":"IF(MIEMBROS!E117>0,MIEMBROS!E117,\"INCOMPLETO RECHAZAR\")","v":"INCOMPLETO RECHAZAR"},445]
[{"$f":"+MIEMBROS!A139","v":"i ORG. REP. LEGAL/ ADM."},{"$f":"+MIEMBROS!B139","v":0},{"$f":"+MIEMBROS!C139","v":0},{"$f":"+MIEMBROS!D139","v":"NOMBRE CARGO REP. LEGAL/ ADMINISTRACIÓN QUE OCUPA:"},{"$f":"IF(MIEMBROS!E139>0,MIEMBROS!E139,\"INCOMPLETO RECHAZAR\")","v":"INCOMPLETO RECHAZAR"},446]
[{"$f":"+MIEMBROS!A161","v":"c MIEMBRO PH"},{"$f":"+MIEMBROS!B161","v":0},{"$f":"+MIEMBROS!C161","v":0},{"$f":"+MIEMBROS!D161","v":"CUIT/CUIL –sin puntos ni barras-:"},{"$f":"IF(MIEMBROS!E161>0,MIEMBROS!E161,\"INCOMPLETO RECHAZAR\")","v":"INCOMPLETO RECHAZAR"},447]
[{"$f":"+MIEMBROS!A183","v":"c MIEMBRO PH"},{"$f":"+MIEMBROS!B183","v":0},{"$f":"+MIEMBROS!C183","v":0},{"$f":"+MIEMBROS!D183","v":"PROFESIÓN/OFICIO:"},{"$f":"IF(MIEMBROS!E183>0,MIEMBROS!E183,\"INCOMPLETO RECHAZAR\")","v":"INCOMPLETO RECHAZAR"},448]
[{"$f":"+MIEMBROS!A205","v":"c MIEMBRO PH"},{"$f":"+MIEMBROS!B205","v":0},{"$f":"+MIEMBROS!C205","v":0},{"$f":"+MIEMBROS!D205","v":"ESTADO CIVIL:"},{"$f":"IF(MIEMBROS!E205>0,MIEMBROS!E205,\"INCOMPLETO RECHAZAR\")","v":"INCOMPLETO RECHAZAR"},449]
[{"$f":"+MIEMBROS!A227","v":"g CONTRIB."},{"$f":"+MIEMBROS!B227","v":0},{"$f":"+MIEMBROS!C227","v":0},{"$f":"+MIEMBROS!D227","v":"CONTRIBUCIÓN -EN PESOS U OTRA MONEDA-:"},{"$f":"IF(MIEMBROS!E227>0,MIEMBROS!E227,\"INCOMPLETO RECHAZAR\")","v":"INCOMPLETO RECHAZAR"},450]
[{"$f":"+MIEMBROS!A249","v":"c MIEMBRO PH"},{"$f":"+MIEMBROS!B249","v":0},{"$f":"+MIEMBROS!C249","v":0},{"$f":"+MIEMBROS!D249","v":"NOTA/OBSERVACIÓN -en mayúscula-:"},{"$f":"IF(MIEMBROS!E249>0,MIEMBROS!E249,\"INCOMPLETO RECHAZAR\")","v":"INCOMPLETO RECHAZAR"},451]
[{"$f":"+MIEMBROS!G43","v":"c MIEMBRO PJ"},{"$f":"+MIEMBROS!H43","v":0},{"$f":"+MIEMBROS!H43","v":0},{"$f":"+MIEMBROS!I43","v":"TIPO DE PERSONA JCA -UNIÓN TRANSITORIA, asociación, mutual, etc-:"},{"$f":"IF(MIEMBROS!J43>0,MIEMBROS!J43,\"INCOMPLETO RECHAZAR\")","v":"INCOMPLETO RECHAZAR"},456]
[{"$f":"+MIEMBROS!G60","v":"c MIEMBRO PJ"},{"$f":"+MIEMBROS!H60","v":0},{"$f":"+MIEMBROS!H60","v":0},{"$f":"+MIEMBROS!I60","v":"APELLIDO/S, NOMBRE/S,  DNI Y CARGO DE CADA MIEMBRO DE SU ADMINISTRACIÓN:"},{"$f":"IF(MIEMBROS!J60>0,MIEMBROS!J60,\"INCOMPLETO RECHAZAR\")","v":"INCOMPLETO RECHAZAR"},457]
[{"$f":"+MIEMBROS!G77","v":"c MIEMBRO PJ"},{"$f":"+MIEMBROS!H77","v":0},{"$f":"+MIEMBROS!H77","v":0},{"$f":"+MIEMBROS!I77","v":"OBJETO PRINCIPAL (EN FORMA RESUMIDA):"},{"$f":"IF(MIEMBROS!J77>0,MIEMBROS!J77,\"INCOMPLETO RECHAZAR\")","v":"INCOMPLETO RECHAZAR"},458]
[{"$f":"+MIEMBROS!G94","v":"c MIEMBRO PJ"},{"$f":"+MIEMBROS!H94","v":0},{"$f":"+MIEMBROS!H94","v":0},{"$f":"+MIEMBROS!I94","v":"CUIT –sin puntos ni barras-:"},{"$f":"IF(MIEMBROS!J94>0,MIEMBROS!J94,\"INCOMPLETO RECHAZAR\")","v":"INCOMPLETO RECHAZAR"},459]
[{"$f":"+MIEMBROS!G111","v":"c MIEMBRO PJ"},{"$f":"+MIEMBROS!H111","v":0},{"$f":"+MIEMBROS!H111","v":0},{"$f":"+MIEMBROS!I111","v":"FECHA DE INSCRIPCION:"},{"$f":"IF(MIEMBROS!J111>0,MIEMBROS!J111,\"INCOMPLETO RECHAZAR\")","v":"INCOMPLETO RECHAZAR"},460]
[{"$f":"+MIEMBROS!G128","v":"c MIEMBRO PJ"},{"$f":"+MIEMBROS!H128","v":0},{"$f":"+MIEMBROS!H128","v":0},{"$f":"+MIEMBROS!I128","v":"CEL/TEL :"},{"$f":"IF(MIEMBROS!J128>0,MIEMBROS!J128,\"INCOMPLETO RECHAZAR\")","v":"INCOMPLETO RECHAZAR"},461]
[{"$f":"+MIEMBROS!G145","v":"c MIEMBRO PJ"},{"$f":"+MIEMBROS!H145","v":0},{"$f":"+MIEMBROS!H145","v":0},{"$f":"+MIEMBROS!I145","v":"NOTA/OBSERVACIÓN -en mayúscula-:"},{"$f":"IF(MIEMBROS!J145>0,MIEMBROS!J145,\"INCOMPLETO RECHAZAR\")","v":"INCOMPLETO RECHAZAR"},462]
[{"$f":"+MIEMBROS!A31","v":"i ORG. REP. LEGAL/ ADM."},{"$f":"+MIEMBROS!B31","v":0},{"$f":"+MIEMBROS!C31","v":0},{"$f":"+MIEMBROS!D31","v":"NOMBRE CARGO REP. LEGAL/ ADMINISTRACIÓN QUE OCUPA:"},{"$f":"IF(MIEMBROS!E31>0,MIEMBROS!E31,\"INCOMPLETO RECHAZAR\")","v":"INCOMPLETO RECHAZAR"},466]
[{"$f":"+MIEMBROS!A53","v":"c MIEMBRO PH"},{"$f":"+MIEMBROS!B53","v":0},{"$f":"+MIEMBROS!C53","v":0},{"$f":"+MIEMBROS!D53","v":"CUIT/CUIL –sin puntos ni barras-:"},{"$f":"IF(MIEMBROS!E53>0,MIEMBROS!E53,\"INCOMPLETO RECHAZAR\")","v":"INCOMPLETO RECHAZAR"},467]
[{"$f":"+MIEMBROS!A75","v":"c MIEMBRO PH"},{"$f":"+MIEMBROS!B75","v":0},{"$f":"+MIEMBROS!C75","v":0},{"$f":"+MIEMBROS!D75","v":"PROFESIÓN/OFICIO:"},{"$f":"IF(MIEMBROS!E75>0,MIEMBROS!E75,\"INCOMPLETO RECHAZAR\")","v":"INCOMPLETO RECHAZAR"},468]
[{"$f":"+MIEMBROS!A97","v":"c MIEMBRO PH"},{"$f":"+MIEMBROS!B97","v":0},{"$f":"+MIEMBROS!C97","v":0},{"$f":"+MIEMBROS!D97","v":"ESTADO CIVIL:"},{"$f":"IF(MIEMBROS!E97>0,MIEMBROS!E97,\"INCOMPLETO RECHAZAR\")","v":"INCOMPLETO RECHAZAR"},469]
[{"$f":"+MIEMBROS!A119","v":"g CONTRIB."},{"$f":"+MIEMBROS!B119","v":0},{"$f":"+MIEMBROS!C119","v":0},{"$f":"+MIEMBROS!D119","v":"CONTRIBUCIÓN -EN PESOS U OTRA MONEDA-:"},{"$f":"IF(MIEMBROS!E119>0,MIEMBROS!E119,\"INCOMPLETO RECHAZAR\")","v":"INCOMPLETO RECHAZAR"},470]
[{"$f":"+MIEMBROS!A141","v":"c MIEMBRO PH"},{"$f":"+MIEMBROS!B141","v":0},{"$f":"+MIEMBROS!C141","v":0},{"$f":"+MIEMBROS!D141","v":"NOTA/OBSERVACIÓN -en mayúscula-:"},{"$f":"IF(MIEMBROS!E141>0,MIEMBROS!E141,\"INCOMPLETO RECHAZAR\")","v":"INCOMPLETO RECHAZAR"},471]
[{"$f":"+MIEMBROS!A163","v":"c MIEMBRO PH"},{"$f":"+MIEMBROS!B163","v":0},{"$f":"+MIEMBROS!C163","v":0},{"$f":"+MIEMBROS!D163","v":"LUGAR DE NACIMIENTO:"},{"$f":"IF(MIEMBROS!E163>0,MIEMBROS!E163,\"INCOMPLETO RECHAZAR\")","v":"INCOMPLETO RECHAZAR"},472]
[{"$f":"+MIEMBROS!A185","v":"c MIEMBRO PH"},{"$f":"+MIEMBROS!B185","v":0},{"$f":"+MIEMBROS!C185","v":0},{"$f":"+MIEMBROS!D185","v":"CEL/TEL :"},{"$f":"IF(MIEMBROS!E185>0,MIEMBROS!E185,\"INCOMPLETO RECHAZAR\")","v":"INCOMPLETO RECHAZAR"},473]
[{"$f":"+MIEMBROS!A207","v":"c MIEMBRO PH"},{"$f":"+MIEMBROS!B207","v":0},{"$f":"+MIEMBROS!C207","v":0},{"$f":"+MIEMBROS!D207","v":""},{"$f":"IF(MIEMBROS!E207>0,MIEMBROS!E207,\"INCOMPLETO RECHAZAR\")","v":"INCOMPLETO RECHAZAR"},474]
[{"$f":"+MIEMBROS!A229","v":"i ORG. REP. LEGAL/ ADM."},{"$f":"+MIEMBROS!B229","v":0},{"$f":"+MIEMBROS!C229","v":0},{"$f":"+MIEMBROS!D229","v":"NOMBRE CARGO REP. LEGAL/ ADMINISTRACIÓN QUE OCUPA:"},{"$f":"IF(MIEMBROS!E229>0,MIEMBROS!E229,\"INCOMPLETO RECHAZAR\")","v":"INCOMPLETO RECHAZAR"},475]
[{"$f":"+MIEMBROS!A251","v":"c MIEMBRO PH"},{"$f":"+MIEMBROS!B251","v":0},{"$f":"+MIEMBROS!C251","v":0},{"$f":"+MIEMBROS!D251","v":"CUIT/CUIL –sin puntos ni barras-:"},{"$f":"IF(MIEMBROS!E251>0,MIEMBROS!E251,\"INCOMPLETO RECHAZAR\")","v":"INCOMPLETO RECHAZAR"},476]
[{"$f":"+'NO MIEMBROS'!A21","v":"i ORG. REP. LEGAL/ ADM."},{"$f":"+'NO MIEMBROS'!B21","v":0},{"$f":"+'NO MIEMBROS'!C21","v":0},{"$f":"+'NO MIEMBROS'!D21","v":"NOMBRE CARGO REP. LEGAL/ ADMINISTRACIÓN QUE OCUPA:"},{"$f":"IF('NO MIEMBROS'!E21>0,'NO MIEMBROS'!E21,\"INCOMPLETO RECHAZAR\")","v":"INCOMPLETO RECHAZAR"},480]
[{"$f":"+'NO MIEMBROS'!A37","v":"i ORG. REP. LEGAL/ ADM."},{"$f":"+'NO MIEMBROS'!B37","v":0},{"$f":"+'NO MIEMBROS'!C37","v":0},{"$f":"+'NO MIEMBROS'!D37","v":"NOMBRE CARGO REP. LEGAL/ ADMINISTRACIÓN QUE OCUPA:"},{"$f":"IF('NO MIEMBROS'!E37>0,'NO MIEMBROS'!E37,\"INCOMPLETO RECHAZAR\")","v":"INCOMPLETO RECHAZAR"},481]
[{"$f":"+'NO MIEMBROS'!A53","v":"i ORG. REP. LEGAL/ ADM."},{"$f":"+'NO MIEMBROS'!B53","v":0},{"$f":"+'NO MIEMBROS'!C53","v":0},{"$f":"+'NO MIEMBROS'!D53","v":"NOMBRE CARGO REP. LEGAL/ ADMINISTRACIÓN QUE OCUPA:"},{"$f":"IF('NO MIEMBROS'!E53>0,'NO MIEMBROS'!E53,\"INCOMPLETO RECHAZAR\")","v":"INCOMPLETO RECHAZAR"},482]
[{"$f":"+'NO MIEMBROS'!A69","v":"i ORG. REP. LEGAL/ ADM."},{"$f":"+'NO MIEMBROS'!B69","v":0},{"$f":"+'NO MIEMBROS'!C69","v":0},{"$f":"+'NO MIEMBROS'!D69","v":"NOMBRE CARGO REP. LEGAL/ ADMINISTRACIÓN QUE OCUPA:"},{"$f":"IF('NO MIEMBROS'!E69>0,'NO MIEMBROS'!E69,\"INCOMPLETO RECHAZAR\")","v":"INCOMPLETO RECHAZAR"},483]
[{"$f":"+'NO MIEMBROS'!A85","v":"i ORG. REP. LEGAL/ ADM."},{"$f":"+'NO MIEMBROS'!B85","v":0},{"$f":"+'NO MIEMBROS'!C85","v":0},{"$f":"+'NO MIEMBROS'!D85","v":"NOMBRE CARGO REP. LEGAL/ ADMINISTRACIÓN QUE OCUPA:"},{"$f":"IF('NO MIEMBROS'!E85>0,'NO MIEMBROS'!E85,\"INCOMPLETO RECHAZAR\")","v":"INCOMPLETO RECHAZAR"},484]
[{"$f":"+'NO MIEMBROS'!A101","v":"i ORG. REP. LEGAL/ ADM."},{"$f":"+'NO MIEMBROS'!B101","v":0},{"$f":"+'NO MIEMBROS'!C101","v":0},{"$f":"+'NO MIEMBROS'!D101","v":"NOMBRE CARGO REP. LEGAL/ ADMINISTRACIÓN QUE OCUPA:"},{"$f":"IF('NO MIEMBROS'!E101>0,'NO MIEMBROS'!E101,\"INCOMPLETO RECHAZAR\")","v":"INCOMPLETO RECHAZAR"},485]
[{"$f":"+'NO MIEMBROS'!A117","v":"i ORG. REP. LEGAL/ ADM."},{"$f":"+'NO MIEMBROS'!B117","v":0},{"$f":"+'NO MIEMBROS'!C117","v":0},{"$f":"+'NO MIEMBROS'!D117","v":"NOMBRE CARGO REP. LEGAL/ ADMINISTRACIÓN QUE OCUPA:"},{"$f":"IF('NO MIEMBROS'!E117>0,'NO MIEMBROS'!E117,\"INCOMPLETO RECHAZAR\")","v":"INCOMPLETO RECHAZAR"},486]
[{"$f":"+'NO MIEMBROS'!A133","v":"i ORG. REP. LEGAL/ ADM."},{"$f":"+'NO MIEMBROS'!B133","v":0},{"$f":"+'NO MIEMBROS'!C133","v":0},{"$f":"+'NO MIEMBROS'!D133","v":"NOMBRE CARGO REP. LEGAL/ ADMINISTRACIÓN QUE OCUPA:"},{"$f":"IF('NO MIEMBROS'!E133>0,'NO MIEMBROS'!E133,\"INCOMPLETO RECHAZAR\")","v":"INCOMPLETO RECHAZAR"},487]
[{"$f":"+'NO MIEMBROS'!A149","v":"i ORG. REP. LEGAL/ ADM."},{"$f":"+'NO MIEMBROS'!B149","v":0},{"$f":"+'NO MIEMBROS'!C149","v":0},{"$f":"+'NO MIEMBROS'!D149","v":"NOMBRE CARGO REP. LEGAL/ ADMINISTRACIÓN QUE OCUPA:"},{"$f":"IF('NO MIEMBROS'!E149>0,'NO MIEMBROS'!E149,\"INCOMPLETO RECHAZAR\")","v":"INCOMPLETO RECHAZAR"},488]
[{"$f":"+'NO MIEMBROS'!A165","v":"i ORG. REP. LEGAL/ ADM."},{"$f":"+'NO MIEMBROS'!B165","v":0},{"$f":"+'NO MIEMBROS'!C165","v":0},{"$f":"+'NO MIEMBROS'!D165","v":"NOMBRE CARGO REP. LEGAL/ ADMINISTRACIÓN QUE OCUPA:"},{"$f":"IF('NO MIEMBROS'!E165>0,'NO MIEMBROS'!E165,\"INCOMPLETO RECHAZAR\")","v":"INCOMPLETO RECHAZAR"},489]
[{"$f":"+'NO MIEMBROS'!A181","v":"i ORG. REP. LEGAL/ ADM."},{"$f":"+'NO MIEMBROS'!B181","v":0},{"$f":"+'NO MIEMBROS'!C181","v":0},{"$f":"+'NO MIEMBROS'!D181","v":"NOMBRE CARGO REP. LEGAL/ ADMINISTRACIÓN QUE OCUPA:"},{"$f":"IF('NO MIEMBROS'!E181>0,'NO MIEMBROS'!E181,\"INCOMPLETO RECHAZAR\")","v":"INCOMPLETO RECHAZAR"},490]
[{"$f":"+'NO MIEMBROS'!A197","v":"i ORG. REP. LEGAL/ ADM."},{"$f":"+'NO MIEMBROS'!B197","v":0},{"$f":"+'NO MIEMBROS'!C197","v":0},{"$f":"+'NO MIEMBROS'!D197","v":"NOMBRE CARGO REP. LEGAL/ ADMINISTRACIÓN QUE OCUPA:"},{"$f":"IF('NO MIEMBROS'!E197>0,'NO MIEMBROS'!E197,\"INCOMPLETO RECHAZAR\")","v":"INCOMPLETO RECHAZAR"},491]
[{"$f":"+'NO MIEMBROS'!A213","v":"i ORG. REP. LEGAL/ ADM."},{"$f":"+'NO MIEMBROS'!B213","v":0},{"$f":"+'NO MIEMBROS'!C213","v":0},{"$f":"+'NO MIEMBROS'!D213","v":"NOMBRE CARGO REP. LEGAL/ ADMINISTRACIÓN QUE OCUPA:"},{"$f":"IF('NO MIEMBROS'!E213>0,'NO MIEMBROS'!E213,\"INCOMPLETO RECHAZAR\")","v":"INCOMPLETO RECHAZAR"},492]
[{"$f":"+'NO MIEMBROS'!A229","v":"i ORG. REP. LEGAL/ ADM."},{"$f":"+'NO MIEMBROS'!B229","v":0},{"$f":"+'NO MIEMBROS'!C229","v":0},{"$f":"+'NO MIEMBROS'!D229","v":"NOMBRE CARGO REP. LEGAL/ ADMINISTRACIÓN QUE OCUPA:"},{"$f":"IF('NO MIEMBROS'!E229>0,'NO MIEMBROS'!E229,\"INCOMPLETO RECHAZAR\")","v":"INCOMPLETO RECHAZAR"},493]
[{"$f":"+'NO MIEMBROS'!A245","v":"i ORG. REP. LEGAL/ ADM."},{"$f":"+'NO MIEMBROS'!B245","v":0},{"$f":"+'NO MIEMBROS'!C245","v":0},{"$f":"+'NO MIEMBROS'!D245","v":"NOMBRE CARGO REP. LEGAL/ ADMINISTRACIÓN QUE OCUPA:"},{"$f":"IF('NO MIEMBROS'!E245>0,'NO MIEMBROS'!E245,\"INCOMPLETO RECHAZAR\")","v":"INCOMPLETO RECHAZAR"},494]
[{"$f":"+MIEMBROS!A32","v":"j ORG. FISCALIZ."},{"$f":"+MIEMBROS!B32","v":0},{"$f":"+MIEMBROS!C32","v":0},{"$f":"+MIEMBROS!D32","v":"NOMBRE CARGO FISCALIZACIÓN QUE OCUPA:"},{"$f":"IF(MIEMBROS!E32>0,MIEMBROS!E32,\"INCOMPLETO RECHAZAR\")","v":"INCOMPLETO RECHAZAR"},495]
[{"$f":"+MIEMBROS!A54","v":"c MIEMBRO PH"},{"$f":"+MIEMBROS!B54","v":0},{"$f":"+MIEMBROS!C54","v":0},{"$f":"+MIEMBROS!D54","v":"FECHA DE NACIMIENTO –dd/mm/aa-:"},{"$f":"IF(MIEMBROS!E54>0,MIEMBROS!E54,\"INCOMPLETO RECHAZAR\")","v":"INCOMPLETO RECHAZAR"},496]
[{"$f":"+MIEMBROS!A76","v":"c MIEMBRO PH"},{"$f":"+MIEMBROS!B76","v":0},{"$f":"+MIEMBROS!C76","v":0},{"$f":"+MIEMBROS!D76","v":"DOMICILIO REAL:"},{"$f":"IF(MIEMBROS!E76>0,MIEMBROS!E76,\"INCOMPLETO RECHAZAR\")","v":"INCOMPLETO RECHAZAR"},497]
[{"$f":"+MIEMBROS!A98","v":"c MIEMBRO PH"},{"$f":"+MIEMBROS!B98","v":0},{"$f":"+MIEMBROS!C98","v":0},{"$f":"+MIEMBROS!D98","v":""},{"$f":"IF(MIEMBROS!E98>0,MIEMBROS!E98,\"INCOMPLETO RECHAZAR\")","v":"INCOMPLETO RECHAZAR"},498]
[{"$f":"+MIEMBROS!A120","v":"f PARTICIPACION"},{"$f":"+MIEMBROS!B120","v":0},{"$f":"+MIEMBROS!C120","v":0},{"$f":"+MIEMBROS!D120","v":"PARTICIPACIÓN S/FONDO COMÚN OPERATIVO (%):"},{"$f":"IF(MIEMBROS!E120>0,MIEMBROS!E120,\"INCOMPLETO RECHAZAR\")","v":{"$error":"#DIV/0!"}},499]
[{"$f":"+MIEMBROS!A142","v":"c MIEMBRO PH"},{"$f":"+MIEMBROS!B142","v":0},{"$f":"+MIEMBROS!C142","v":0},{"$f":"+MIEMBROS!D142","v":"DOC. IDENTIDAD –sin puntos-:"},{"$f":"IF(MIEMBROS!E142>0,MIEMBROS!E142,\"INCOMPLETO RECHAZAR\")","v":"INCOMPLETO RECHAZAR"},500]
[{"$f":"+MIEMBROS!A164","v":"c MIEMBRO PH"},{"$f":"+MIEMBROS!B164","v":0},{"$f":"+MIEMBROS!C164","v":0},{"$f":"+MIEMBROS!D164","v":"NACIONALIDAD:"},{"$f":"IF(MIEMBROS!E164>0,MIEMBROS!E164,\"INCOMPLETO RECHAZAR\")","v":"INCOMPLETO RECHAZAR"},501]
[{"$f":"+MIEMBROS!A186","v":"c MIEMBRO PH"},{"$f":"+MIEMBROS!B186","v":0},{"$f":"+MIEMBROS!C186","v":0},{"$f":"+MIEMBROS!D186","v":"EMAIL:"},{"$f":"IF(MIEMBROS!E186>0,MIEMBROS!E186,\"INCOMPLETO RECHAZAR\")","v":"INCOMPLETO RECHAZAR"},502]
[{"$f":"+MIEMBROS!A208","v":"c MIEMBRO PH"},{"$f":"+MIEMBROS!B208","v":0},{"$f":"+MIEMBROS!C208","v":0},{"$f":"+MIEMBROS!D208","v":""},{"$f":"IF(MIEMBROS!E208>0,MIEMBROS!E208,\"INCOMPLETO RECHAZAR\")","v":"INCOMPLETO RECHAZAR"},503]
[{"$f":"+MIEMBROS!A230","v":"j ORG. FISCALIZ."},{"$f":"+MIEMBROS!B230","v":0},{"$f":"+MIEMBROS!C230","v":0},{"$f":"+MIEMBROS!D230","v":"NOMBRE CARGO FISCALIZACIÓN QUE OCUPA:"},{"$f":"IF(MIEMBROS!E230>0,MIEMBROS!E230,\"INCOMPLETO RECHAZAR\")","v":"INCOMPLETO RECHAZAR"},504]
[{"$f":"+MIEMBROS!A252","v":"c MIEMBRO PH"},{"$f":"+MIEMBROS!B252","v":0},{"$f":"+MIEMBROS!C252","v":0},{"$f":"+MIEMBROS!D252","v":"FECHA DE NACIMIENTO –dd/mm/aa-:"},{"$f":"IF(MIEMBROS!E252>0,MIEMBROS!E252,\"INCOMPLETO RECHAZAR\")","v":"INCOMPLETO RECHAZAR"},505]
[{"$f":"+'NO MIEMBROS'!A22","v":"j ORG. FISCALIZ."},{"$f":"+'NO MIEMBROS'!B22","v":0},{"$f":"+'NO MIEMBROS'!C22","v":0},{"$f":"+'NO MIEMBROS'!D22","v":"NOMBRE CARGO FISCALIZACIÓN QUE OCUPA:"},{"$f":"IF('NO MIEMBROS'!E22>0,'NO MIEMBROS'!E22,\"INCOMPLETO RECHAZAR\")","v":"INCOMPLETO RECHAZAR"},509]
[{"$f":"+'NO MIEMBROS'!A38","v":"j ORG. FISCALIZ."},{"$f":"+'NO MIEMBROS'!B38","v":0},{"$f":"+'NO MIEMBROS'!C38","v":0},{"$f":"+'NO MIEMBROS'!D38","v":"NOMBRE CARGO FISCALIZACIÓN QUE OCUPA:"},{"$f":"IF('NO MIEMBROS'!E38>0,'NO MIEMBROS'!E38,\"INCOMPLETO RECHAZAR\")","v":"INCOMPLETO RECHAZAR"},510]
[{"$f":"+'NO MIEMBROS'!A54","v":"j ORG. FISCALIZ."},{"$f":"+'NO MIEMBROS'!B54","v":0},{"$f":"+'NO MIEMBROS'!C54","v":0},{"$f":"+'NO MIEMBROS'!D54","v":"NOMBRE CARGO FISCALIZACIÓN QUE OCUPA:"},{"$f":"IF('NO MIEMBROS'!E54>0,'NO MIEMBROS'!E54,\"INCOMPLETO RECHAZAR\")","v":"INCOMPLETO RECHAZAR"},511]
[{"$f":"+'NO MIEMBROS'!A70","v":"j ORG. FISCALIZ."},{"$f":"+'NO MIEMBROS'!B70","v":0},{"$f":"+'NO MIEMBROS'!C70","v":0},{"$f":"+'NO MIEMBROS'!D70","v":"NOMBRE CARGO FISCALIZACIÓN QUE OCUPA:"},{"$f":"IF('NO MIEMBROS'!E70>0,'NO MIEMBROS'!E70,\"INCOMPLETO RECHAZAR\")","v":"INCOMPLETO RECHAZAR"},512]
[{"$f":"+'NO MIEMBROS'!A86","v":"j ORG. FISCALIZ."},{"$f":"+'NO MIEMBROS'!B86","v":0},{"$f":"+'NO MIEMBROS'!C86","v":0},{"$f":"+'NO MIEMBROS'!D86","v":"NOMBRE CARGO FISCALIZACIÓN QUE OCUPA:"},{"$f":"IF('NO MIEMBROS'!E86>0,'NO MIEMBROS'!E86,\"INCOMPLETO RECHAZAR\")","v":"INCOMPLETO RECHAZAR"},513]
[{"$f":"+'NO MIEMBROS'!A102","v":"j ORG. FISCALIZ."},{"$f":"+'NO MIEMBROS'!B102","v":0},{"$f":"+'NO MIEMBROS'!C102","v":0},{"$f":"+'NO MIEMBROS'!D102","v":"NOMBRE CARGO FISCALIZACIÓN QUE OCUPA:"},{"$f":"IF('NO MIEMBROS'!E102>0,'NO MIEMBROS'!E102,\"INCOMPLETO RECHAZAR\")","v":"INCOMPLETO RECHAZAR"},514]
[{"$f":"+'NO MIEMBROS'!A118","v":"j ORG. FISCALIZ."},{"$f":"+'NO MIEMBROS'!B118","v":0},{"$f":"+'NO MIEMBROS'!C118","v":0},{"$f":"+'NO MIEMBROS'!D118","v":"NOMBRE CARGO FISCALIZACIÓN QUE OCUPA:"},{"$f":"IF('NO MIEMBROS'!E118>0,'NO MIEMBROS'!E118,\"INCOMPLETO RECHAZAR\")","v":"INCOMPLETO RECHAZAR"},515]
[{"$f":"+'NO MIEMBROS'!A134","v":"j ORG. FISCALIZ."},{"$f":"+'NO MIEMBROS'!B134","v":0},{"$f":"+'NO MIEMBROS'!C134","v":0},{"$f":"+'NO MIEMBROS'!D134","v":"NOMBRE CARGO FISCALIZACIÓN QUE OCUPA:"},{"$f":"IF('NO MIEMBROS'!E134>0,'NO MIEMBROS'!E134,\"INCOMPLETO RECHAZAR\")","v":"INCOMPLETO RECHAZAR"},516]
[{"$f":"+'NO MIEMBROS'!A150","v":"j ORG. FISCALIZ."},{"$f":"+'NO MIEMBROS'!B150","v":0},{"$f":"+'NO MIEMBROS'!C150","v":0},{"$f":"+'NO MIEMBROS'!D150","v":"NOMBRE CARGO FISCALIZACIÓN QUE OCUPA:"},{"$f":"IF('NO MIEMBROS'!E150>0,'NO MIEMBROS'!E150,\"INCOMPLETO RECHAZAR\")","v":"INCOMPLETO RECHAZAR"},517]
[{"$f":"+'NO MIEMBROS'!A166","v":"j ORG. FISCALIZ."},{"$f":"+'NO MIEMBROS'!B166","v":0},{"$f":"+'NO MIEMBROS'!C166","v":0},{"$f":"+'NO MIEMBROS'!D166","v":"NOMBRE CARGO FISCALIZACIÓN QUE OCUPA:"},{"$f":"IF('NO MIEMBROS'!E166>0,'NO MIEMBROS'!E166,\"INCOMPLETO RECHAZAR\")","v":"INCOMPLETO RECHAZAR"},518]
[{"$f":"+'NO MIEMBROS'!A182","v":"j ORG. FISCALIZ."},{"$f":"+'NO MIEMBROS'!B182","v":0},{"$f":"+'NO MIEMBROS'!C182","v":0},{"$f":"+'NO MIEMBROS'!D182","v":"NOMBRE CARGO FISCALIZACIÓN QUE OCUPA:"},{"$f":"IF('NO MIEMBROS'!E182>0,'NO MIEMBROS'!E182,\"INCOMPLETO RECHAZAR\")","v":"INCOMPLETO RECHAZAR"},519]
[{"$f":"+'NO MIEMBROS'!A198","v":"j ORG. FISCALIZ."},{"$f":"+'NO MIEMBROS'!B198","v":0},{"$f":"+'NO MIEMBROS'!C198","v":0},{"$f":"+'NO MIEMBROS'!D198","v":"NOMBRE CARGO FISCALIZACIÓN QUE OCUPA:"},{"$f":"IF('NO MIEMBROS'!E198>0,'NO MIEMBROS'!E198,\"INCOMPLETO RECHAZAR\")","v":"INCOMPLETO RECHAZAR"},520]
[{"$f":"+'NO MIEMBROS'!A214","v":"j ORG. FISCALIZ."},{"$f":"+'NO MIEMBROS'!B214","v":0},{"$f":"+'NO MIEMBROS'!C214","v":0},{"$f":"+'NO MIEMBROS'!D214","v":"NOMBRE CARGO FISCALIZACIÓN QUE OCUPA:"},{"$f":"IF('NO MIEMBROS'!E214>0,'NO MIEMBROS'!E214,\"INCOMPLETO RECHAZAR\")","v":"INCOMPLETO RECHAZAR"},521]
[{"$f":"+'NO MIEMBROS'!A230","v":"j ORG. FISCALIZ."},{"$f":"+'NO MIEMBROS'!B230","v":0},{"$f":"+'NO MIEMBROS'!C230","v":0},{"$f":"+'NO MIEMBROS'!D230","v":"NOMBRE CARGO FISCALIZACIÓN QUE OCUPA:"},{"$f":"IF('NO MIEMBROS'!E230>0,'NO MIEMBROS'!E230,\"INCOMPLETO RECHAZAR\")","v":"INCOMPLETO RECHAZAR"},522]
[{"$f":"+'NO MIEMBROS'!A246","v":"j ORG. FISCALIZ."},{"$f":"+'NO MIEMBROS'!B246","v":0},{"$f":"+'NO MIEMBROS'!C246","v":0},{"$f":"+'NO MIEMBROS'!D246","v":"NOMBRE CARGO FISCALIZACIÓN QUE OCUPA:"},{"$f":"IF('NO MIEMBROS'!E246>0,'NO MIEMBROS'!E246,\"INCOMPLETO RECHAZAR\")","v":"INCOMPLETO RECHAZAR"},523]
[{"$f":"+'NO MIEMBROS'!A16","v":"l NO MIEMBRO"},{"$f":"+'NO MIEMBROS'!B16","v":0},{"$f":"+'NO MIEMBROS'!C16","v":0},{"$f":"+'NO MIEMBROS'!D16","v":"EMAIL:"},{"$f":"IF('NO MIEMBROS'!E16>0,'NO MIEMBROS'!E16,\"INCOMPLETO RECHAZAR\")","v":"INCOMPLETO RECHAZAR"},524]
[{"$f":"+'NO MIEMBROS'!A32","v":"l NO MIEMBRO"},{"$f":"+'NO MIEMBROS'!B32","v":0},{"$f":"+'NO MIEMBROS'!C32","v":0},{"$f":"+'NO MIEMBROS'!D32","v":"EMAIL:"},{"$f":"IF('NO MIEMBROS'!E32>0,'NO MIEMBROS'!E32,\"INCOMPLETO RECHAZAR\")","v":"INCOMPLETO RECHAZAR"},525]
[{"$f":"+'NO MIEMBROS'!A48","v":"l NO MIEMBRO"},{"$f":"+'NO MIEMBROS'!B48","v":0},{"$f":"+'NO MIEMBROS'!C48","v":0},{"$f":"+'NO MIEMBROS'!D48","v":"EMAIL:"},{"$f":"IF('NO MIEMBROS'!E48>0,'NO MIEMBROS'!E48,\"INCOMPLETO RECHAZAR\")","v":"INCOMPLETO RECHAZAR"},526]
[{"$f":"+'NO MIEMBROS'!A64","v":"l NO MIEMBRO"},{"$f":"+'NO MIEMBROS'!B64","v":0},{"$f":"+'NO MIEMBROS'!C64","v":0},{"$f":"+'NO MIEMBROS'!D64","v":"EMAIL:"},{"$f":"IF('NO MIEMBROS'!E64>0,'NO MIEMBROS'!E64,\"INCOMPLETO RECHAZAR\")","v":"INCOMPLETO RECHAZAR"},527]
[{"$f":"+'NO MIEMBROS'!A80","v":"l NO MIEMBRO"},{"$f":"+'NO MIEMBROS'!B80","v":0},{"$f":"+'NO MIEMBROS'!C80","v":0},{"$f":"+'NO MIEMBROS'!D80","v":"EMAIL:"},{"$f":"IF('NO MIEMBROS'!E80>0,'NO MIEMBROS'!E80,\"INCOMPLETO RECHAZAR\")","v":"INCOMPLETO RECHAZAR"},528]
[{"$f":"+'NO MIEMBROS'!A96","v":"l NO MIEMBRO"},{"$f":"+'NO MIEMBROS'!B96","v":0},{"$f":"+'NO MIEMBROS'!C96","v":0},{"$f":"+'NO MIEMBROS'!D96","v":"EMAIL:"},{"$f":"IF('NO MIEMBROS'!E96>0,'NO MIEMBROS'!E96,\"INCOMPLETO RECHAZAR\")","v":"INCOMPLETO RECHAZAR"},529]
[{"$f":"+'NO MIEMBROS'!A112","v":"l NO MIEMBRO"},{"$f":"+'NO MIEMBROS'!B112","v":0},{"$f":"+'NO MIEMBROS'!C112","v":0},{"$f":"+'NO MIEMBROS'!D112","v":"EMAIL:"},{"$f":"IF('NO MIEMBROS'!E112>0,'NO MIEMBROS'!E112,\"INCOMPLETO RECHAZAR\")","v":"INCOMPLETO RECHAZAR"},530]
[{"$f":"+'NO MIEMBROS'!A128","v":"l NO MIEMBRO"},{"$f":"+'NO MIEMBROS'!B128","v":0},{"$f":"+'NO MIEMBROS'!C128","v":0},{"$f":"+'NO MIEMBROS'!D128","v":"EMAIL:"},{"$f":"IF('NO MIEMBROS'!E128>0,'NO MIEMBROS'!E128,\"INCOMPLETO RECHAZAR\")","v":"INCOMPLETO RECHAZAR"},531]
[{"$f":"+'NO MIEMBROS'!A144","v":"l NO MIEMBRO"},{"$f":"+'NO MIEMBROS'!B144","v":0},{"$f":"+'NO MIEMBROS'!C144","v":0},{"$f":"+'NO MIEMBROS'!D144","v":"EMAIL:"},{"$f":"IF('NO MIEMBROS'!E144>0,'NO MIEMBROS'!E144,\"INCOMPLETO RECHAZAR\")","v":"INCOMPLETO RECHAZAR"},532]
[{"$f":"+'NO MIEMBROS'!A160","v":"l NO MIEMBRO"},{"$f":"+'NO MIEMBROS'!B160","v":0},{"$f":"+'NO MIEMBROS'!C160","v":0},{"$f":"+'NO MIEMBROS'!D160","v":"EMAIL:"},{"$f":"IF('NO MIEMBROS'!E160>0,'NO MIEMBROS'!E160,\"INCOMPLETO RECHAZAR\")","v":"INCOMPLETO RECHAZAR"},533]
[{"$f":"+'NO MIEMBROS'!A176","v":"l NO MIEMBRO"},{"$f":"+'NO MIEMBROS'!B176","v":0},{"$f":"+'NO MIEMBROS'!C176","v":0},{"$f":"+'NO MIEMBROS'!D176","v":"EMAIL:"},{"$f":"IF('NO MIEMBROS'!E176>0,'NO MIEMBROS'!E176,\"INCOMPLETO RECHAZAR\")","v":"INCOMPLETO RECHAZAR"},534]
[{"$f":"+'NO MIEMBROS'!A192","v":"l NO MIEMBRO"},{"$f":"+'NO MIEMBROS'!B192","v":0},{"$f":"+'NO MIEMBROS'!C192","v":0},{"$f":"+'NO MIEMBROS'!D192","v":"EMAIL:"},{"$f":"IF('NO MIEMBROS'!E192>0,'NO MIEMBROS'!E192,\"INCOMPLETO RECHAZAR\")","v":"INCOMPLETO RECHAZAR"},535]
[{"$f":"+'NO MIEMBROS'!A208","v":"l NO MIEMBRO"},{"$f":"+'NO MIEMBROS'!B208","v":0},{"$f":"+'NO MIEMBROS'!C208","v":0},{"$f":"+'NO MIEMBROS'!D208","v":"EMAIL:"},{"$f":"IF('NO MIEMBROS'!E208>0,'NO MIEMBROS'!E208,\"INCOMPLETO RECHAZAR\")","v":"INCOMPLETO RECHAZAR"},536]
[{"$f":"+'NO MIEMBROS'!A224","v":"l NO MIEMBRO"},{"$f":"+'NO MIEMBROS'!B224","v":0},{"$f":"+'NO MIEMBROS'!C224","v":0},{"$f":"+'NO MIEMBROS'!D224","v":"EMAIL:"},{"$f":"IF('NO MIEMBROS'!E224>0,'NO MIEMBROS'!E224,\"INCOMPLETO RECHAZAR\")","v":"INCOMPLETO RECHAZAR"},537]
[{"$f":"+'NO MIEMBROS'!A240","v":"l NO MIEMBRO"},{"$f":"+'NO MIEMBROS'!B240","v":0},{"$f":"+'NO MIEMBROS'!C240","v":0},{"$f":"+'NO MIEMBROS'!D240","v":"EMAIL:"},{"$f":"IF('NO MIEMBROS'!E240>0,'NO MIEMBROS'!E240,\"INCOMPLETO RECHAZAR\")","v":"INCOMPLETO RECHAZAR"},538]
[{"$f":"+'NO MIEMBROS'!A18","v":"l NO MIEMBRO"},{"$f":"+'NO MIEMBROS'!B18","v":0},{"$f":"+'NO MIEMBROS'!C18","v":0},{"$f":"+'NO MIEMBROS'!D18","v":""},{"$f":"IF('NO MIEMBROS'!E18>0,'NO MIEMBROS'!E18,\"INCOMPLETO RECHAZAR\")","v":"INCOMPLETO RECHAZAR"},539]
[{"$f":"+'NO MIEMBROS'!A15","v":"l NO MIEMBRO"},{"$f":"+'NO MIEMBROS'!B15","v":0},{"$f":"+'NO MIEMBROS'!C15","v":0},{"$f":"+'NO MIEMBROS'!D15","v":"CEL/TEL :"},{"$f":"IF('NO MIEMBROS'!E15>0,'NO MIEMBROS'!E15,\"INCOMPLETO RECHAZAR\")","v":"INCOMPLETO RECHAZAR"},540]
[{"$f":"+'NO MIEMBROS'!A9","v":"l NO MIEMBRO"},{"$f":"+'NO MIEMBROS'!B9","v":0},{"$f":"+'NO MIEMBROS'!C9","v":0},{"$f":"+'NO MIEMBROS'!D9","v":"CUIT/CUIL –sin puntos ni barras-:"},{"$f":"IF('NO MIEMBROS'!E9>0,'NO MIEMBROS'!E9,\"INCOMPLETO RECHAZAR\")","v":"INCOMPLETO RECHAZAR"},541]
[{"$f":"+'NO MIEMBROS'!A20","v":"l NO MIEMBRO"},{"$f":"+'NO MIEMBROS'!B20","v":0},{"$f":"+'NO MIEMBROS'!C20","v":0},{"$f":"+'NO MIEMBROS'!D20","v":""},{"$f":"IF('NO MIEMBROS'!E20>0,'NO MIEMBROS'!E20,\"INCOMPLETO RECHAZAR\")","v":"INCOMPLETO RECHAZAR"},542]
[{"$f":"+'NO MIEMBROS'!A8","v":"l NO MIEMBRO"},{"$f":"+'NO MIEMBROS'!B8","v":0},{"$f":"+'NO MIEMBROS'!C8","v":0},{"$f":"+'NO MIEMBROS'!D8","v":"DOC. IDENTIDAD –sin puntos-:"},{"$f":"IF('NO MIEMBROS'!E8>0,'NO MIEMBROS'!E8,\"INCOMPLETO RECHAZAR\")","v":"INCOMPLETO RECHAZAR"},543]
[{"$f":"+'NO MIEMBROS'!A14","v":"l NO MIEMBRO"},{"$f":"+'NO MIEMBROS'!B14","v":0},{"$f":"+'NO MIEMBROS'!C14","v":0},{"$f":"+'NO MIEMBROS'!D14","v":"DOMICILIO REAL:"},{"$f":"IF('NO MIEMBROS'!E14>0,'NO MIEMBROS'!E14,\"INCOMPLETO RECHAZAR\")","v":"INCOMPLETO RECHAZAR"},544]
[{"$f":"+'NO MIEMBROS'!A17","v":"l NO MIEMBRO"},{"$f":"+'NO MIEMBROS'!B17","v":0},{"$f":"+'NO MIEMBROS'!C17","v":0},{"$f":"+'NO MIEMBROS'!D17","v":"ESTADO CIVIL:"},{"$f":"IF('NO MIEMBROS'!E17>0,'NO MIEMBROS'!E17,\"INCOMPLETO RECHAZAR\")","v":"INCOMPLETO RECHAZAR"},545]
[{"$f":"+'NO MIEMBROS'!A10","v":"l NO MIEMBRO"},{"$f":"+'NO MIEMBROS'!B10","v":0},{"$f":"+'NO MIEMBROS'!C10","v":0},{"$f":"+'NO MIEMBROS'!D10","v":"FECHA DE NACIMIENTO –dd/mm/aa-:"},{"$f":"IF('NO MIEMBROS'!E10>0,'NO MIEMBROS'!E10,\"INCOMPLETO RECHAZAR\")","v":"INCOMPLETO RECHAZAR"},546]
[{"$f":"+'NO MIEMBROS'!A11","v":"l NO MIEMBRO"},{"$f":"+'NO MIEMBROS'!B11","v":0},{"$f":"+'NO MIEMBROS'!C11","v":0},{"$f":"+'NO MIEMBROS'!D11","v":"LUGAR DE NACIMIENTO:"},{"$f":"IF('NO MIEMBROS'!E11>0,'NO MIEMBROS'!E11,\"INCOMPLETO RECHAZAR\")","v":"INCOMPLETO RECHAZAR"},547]
[{"$f":"+'NO MIEMBROS'!A12","v":"l NO MIEMBRO"},{"$f":"+'NO MIEMBROS'!B12","v":0},{"$f":"+'NO MIEMBROS'!C12","v":0},{"$f":"+'NO MIEMBROS'!D12","v":"NACIONALIDAD:"},{"$f":"IF('NO MIEMBROS'!E12>0,'NO MIEMBROS'!E12,\"INCOMPLETO RECHAZAR\")","v":"INCOMPLETO RECHAZAR"},548]
[{"$f":"+'NO MIEMBROS'!A19","v":"l NO MIEMBRO"},{"$f":"+'NO MIEMBROS'!B19","v":0},{"$f":"+'NO MIEMBROS'!C19","v":0},{"$f":"+'NO MIEMBROS'!D19","v":""},{"$f":"IF('NO MIEMBROS'!E19>0,'NO MIEMBROS'!E19,\"INCOMPLETO RECHAZAR\")","v":"INCOMPLETO RECHAZAR"},549]
[{"$f":"+'NO MIEMBROS'!A23","v":"l NO MIEMBRO"},{"$f":"+'NO MIEMBROS'!B23","v":0},{"$f":"+'NO MIEMBROS'!C23","v":0},{"$f":"+'NO MIEMBROS'!D23","v":"NOTA/OBSERVACIÓN -en mayúscula-:"},{"$f":"IF('NO MIEMBROS'!E23>0,'NO MIEMBROS'!E23,\"INCOMPLETO RECHAZAR\")","v":"INCOMPLETO RECHAZAR"},550]
[{"$f":"+'NO MIEMBROS'!A13","v":"l NO MIEMBRO"},{"$f":"+'NO MIEMBROS'!B13","v":0},{"$f":"+'NO MIEMBROS'!C13","v":0},{"$f":"+'NO MIEMBROS'!D13","v":"PROFESIÓN/OFICIO:"},{"$f":"IF('NO MIEMBROS'!E13>0,'NO MIEMBROS'!E13,\"INCOMPLETO RECHAZAR\")","v":"INCOMPLETO RECHAZAR"},551]
[{"$f":"+'NO MIEMBROS'!A34","v":"l NO MIEMBRO"},{"$f":"+'NO MIEMBROS'!B34","v":0},{"$f":"+'NO MIEMBROS'!C34","v":0},{"$f":"+'NO MIEMBROS'!D34","v":""},{"$f":"IF('NO MIEMBROS'!E34>0,'NO MIEMBROS'!E34,\"INCOMPLETO RECHAZAR\")","v":"INCOMPLETO RECHAZAR"},552]
[{"$f":"+'NO MIEMBROS'!A31","v":"l NO MIEMBRO"},{"$f":"+'NO MIEMBROS'!B31","v":0},{"$f":"+'NO MIEMBROS'!C31","v":0},{"$f":"+'NO MIEMBROS'!D31","v":"CEL/TEL :"},{"$f":"IF('NO MIEMBROS'!E31>0,'NO MIEMBROS'!E31,\"INCOMPLETO RECHAZAR\")","v":"INCOMPLETO RECHAZAR"},553]
[{"$f":"+'NO MIEMBROS'!A25","v":"l NO MIEMBRO"},{"$f":"+'NO MIEMBROS'!B25","v":0},{"$f":"+'NO MIEMBROS'!C25","v":0},{"$f":"+'NO MIEMBROS'!D25","v":"CUIT/CUIL –sin puntos ni barras-:"},{"$f":"IF('NO MIEMBROS'!E25>0,'NO MIEMBROS'!E25,\"INCOMPLETO RECHAZAR\")","v":"INCOMPLETO RECHAZAR"},554]
[{"$f":"+'NO MIEMBROS'!A36","v":"l NO MIEMBRO"},{"$f":"+'NO MIEMBROS'!B36","v":0},{"$f":"+'NO MIEMBROS'!C36","v":0},{"$f":"+'NO MIEMBROS'!D36","v":""},{"$f":"IF('NO MIEMBROS'!E36>0,'NO MIEMBROS'!E36,\"INCOMPLETO RECHAZAR\")","v":"INCOMPLETO RECHAZAR"},555]
[{"$f":"+'NO MIEMBROS'!A24","v":"l NO MIEMBRO"},{"$f":"+'NO MIEMBROS'!B24","v":0},{"$f":"+'NO MIEMBROS'!C24","v":0},{"$f":"+'NO MIEMBROS'!D24","v":"DOC. IDENTIDAD –sin puntos-:"},{"$f":"IF('NO MIEMBROS'!E24>0,'NO MIEMBROS'!E24,\"INCOMPLETO RECHAZAR\")","v":"INCOMPLETO RECHAZAR"},556]
[{"$f":"+'NO MIEMBROS'!A30","v":"l NO MIEMBRO"},{"$f":"+'NO MIEMBROS'!B30","v":0},{"$f":"+'NO MIEMBROS'!C30","v":0},{"$f":"+'NO MIEMBROS'!D30","v":"DOMICILIO REAL:"},{"$f":"IF('NO MIEMBROS'!E30>0,'NO MIEMBROS'!E30,\"INCOMPLETO RECHAZAR\")","v":"INCOMPLETO RECHAZAR"},557]
[{"$f":"+'NO MIEMBROS'!A33","v":"l NO MIEMBRO"},{"$f":"+'NO MIEMBROS'!B33","v":0},{"$f":"+'NO MIEMBROS'!C33","v":0},{"$f":"+'NO MIEMBROS'!D33","v":"ESTADO CIVIL:"},{"$f":"IF('NO MIEMBROS'!E33>0,'NO MIEMBROS'!E33,\"INCOMPLETO RECHAZAR\")","v":"INCOMPLETO RECHAZAR"},558]
[{"$f":"+'NO MIEMBROS'!A26","v":"l NO MIEMBRO"},{"$f":"+'NO MIEMBROS'!B26","v":0},{"$f":"+'NO MIEMBROS'!C26","v":0},{"$f":"+'NO MIEMBROS'!D26","v":"FECHA DE NACIMIENTO –dd/mm/aa-:"},{"$f":"IF('NO MIEMBROS'!E26>0,'NO MIEMBROS'!E26,\"INCOMPLETO RECHAZAR\")","v":"INCOMPLETO RECHAZAR"},559]
[{"$f":"+'NO MIEMBROS'!A27","v":"l NO MIEMBRO"},{"$f":"+'NO MIEMBROS'!B27","v":0},{"$f":"+'NO MIEMBROS'!C27","v":0},{"$f":"+'NO MIEMBROS'!D27","v":"LUGAR DE NACIMIENTO:"},{"$f":"IF('NO MIEMBROS'!E27>0,'NO MIEMBROS'!E27,\"INCOMPLETO RECHAZAR\")","v":"INCOMPLETO RECHAZAR"},560]
[{"$f":"+'NO MIEMBROS'!A28","v":"l NO MIEMBRO"},{"$f":"+'NO MIEMBROS'!B28","v":0},{"$f":"+'NO MIEMBROS'!C28","v":0},{"$f":"+'NO MIEMBROS'!D28","v":"NACIONALIDAD:"},{"$f":"IF('NO MIEMBROS'!E28>0,'NO MIEMBROS'!E28,\"INCOMPLETO RECHAZAR\")","v":"INCOMPLETO RECHAZAR"},561]
[{"$f":"+'NO MIEMBROS'!A35","v":"l NO MIEMBRO"},{"$f":"+'NO MIEMBROS'!B35","v":0},{"$f":"+'NO MIEMBROS'!C35","v":0},{"$f":"+'NO MIEMBROS'!D35","v":""},{"$f":"IF('NO MIEMBROS'!E35>0,'NO MIEMBROS'!E35,\"INCOMPLETO RECHAZAR\")","v":"INCOMPLETO RECHAZAR"},562]
[{"$f":"+'NO MIEMBROS'!A39","v":"l NO MIEMBRO"},{"$f":"+'NO MIEMBROS'!B39","v":0},{"$f":"+'NO MIEMBROS'!C39","v":0},{"$f":"+'NO MIEMBROS'!D39","v":"NOTA/OBSERVACIÓN -en mayúscula-:"},{"$f":"IF('NO MIEMBROS'!E39>0,'NO MIEMBROS'!E39,\"INCOMPLETO RECHAZAR\")","v":"INCOMPLETO RECHAZAR"},563]
[{"$f":"+'NO MIEMBROS'!A29","v":"l NO MIEMBRO"},{"$f":"+'NO MIEMBROS'!B29","v":0},{"$f":"+'NO MIEMBROS'!C29","v":0},{"$f":"+'NO MIEMBROS'!D29","v":"PROFESIÓN/OFICIO:"},{"$f":"IF('NO MIEMBROS'!E29>0,'NO MIEMBROS'!E29,\"INCOMPLETO RECHAZAR\")","v":"INCOMPLETO RECHAZAR"},564]
[{"$f":"+'NO MIEMBROS'!A50","v":"l NO MIEMBRO"},{"$f":"+'NO MIEMBROS'!B50","v":0},{"$f":"+'NO MIEMBROS'!C50","v":0},{"$f":"+'NO MIEMBROS'!D50","v":""},{"$f":"IF('NO MIEMBROS'!E50>0,'NO MIEMBROS'!E50,\"INCOMPLETO RECHAZAR\")","v":"INCOMPLETO RECHAZAR"},565]
[{"$f":"+'NO MIEMBROS'!A47","v":"l NO MIEMBRO"},{"$f":"+'NO MIEMBROS'!B47","v":0},{"$f":"+'NO MIEMBROS'!C47","v":0},{"$f":"+'NO MIEMBROS'!D47","v":"CEL/TEL :"},{"$f":"IF('NO MIEMBROS'!E47>0,'NO MIEMBROS'!E47,\"INCOMPLETO RECHAZAR\")","v":"INCOMPLETO RECHAZAR"},566]
[{"$f":"+'NO MIEMBROS'!A41","v":"l NO MIEMBRO"},{"$f":"+'NO MIEMBROS'!B41","v":0},{"$f":"+'NO MIEMBROS'!C41","v":0},{"$f":"+'NO MIEMBROS'!D41","v":"CUIT/CUIL –sin puntos ni barras-:"},{"$f":"IF('NO MIEMBROS'!E41>0,'NO MIEMBROS'!E41,\"INCOMPLETO RECHAZAR\")","v":"INCOMPLETO RECHAZAR"},567]
[{"$f":"+'NO MIEMBROS'!A52","v":"l NO MIEMBRO"},{"$f":"+'NO MIEMBROS'!B52","v":0},{"$f":"+'NO MIEMBROS'!C52","v":0},{"$f":"+'NO MIEMBROS'!D52","v":""},{"$f":"IF('NO MIEMBROS'!E52>0,'NO MIEMBROS'!E52,\"INCOMPLETO RECHAZAR\")","v":"INCOMPLETO RECHAZAR"},568]
[{"$f":"+'NO MIEMBROS'!A40","v":"l NO MIEMBRO"},{"$f":"+'NO MIEMBROS'!B40","v":0},{"$f":"+'NO MIEMBROS'!C40","v":0},{"$f":"+'NO MIEMBROS'!D40","v":"DOC. IDENTIDAD –sin puntos-:"},{"$f":"IF('NO MIEMBROS'!E40>0,'NO MIEMBROS'!E40,\"INCOMPLETO RECHAZAR\")","v":"INCOMPLETO RECHAZAR"},569]
[{"$f":"+'NO MIEMBROS'!A46","v":"l NO MIEMBRO"},{"$f":"+'NO MIEMBROS'!B46","v":0},{"$f":"+'NO MIEMBROS'!C46","v":0},{"$f":"+'NO MIEMBROS'!D46","v":"DOMICILIO REAL:"},{"$f":"IF('NO MIEMBROS'!E46>0,'NO MIEMBROS'!E46,\"INCOMPLETO RECHAZAR\")","v":"INCOMPLETO RECHAZAR"},570]
[{"$f":"+'NO MIEMBROS'!A49","v":"l NO MIEMBRO"},{"$f":"+'NO MIEMBROS'!B49","v":0},{"$f":"+'NO MIEMBROS'!C49","v":0},{"$f":"+'NO MIEMBROS'!D49","v":"ESTADO CIVIL:"},{"$f":"IF('NO MIEMBROS'!E49>0,'NO MIEMBROS'!E49,\"INCOMPLETO RECHAZAR\")","v":"INCOMPLETO RECHAZAR"},571]
[{"$f":"+'NO MIEMBROS'!A42","v":"l NO MIEMBRO"},{"$f":"+'NO MIEMBROS'!B42","v":0},{"$f":"+'NO MIEMBROS'!C42","v":0},{"$f":"+'NO MIEMBROS'!D42","v":"FECHA DE NACIMIENTO –dd/mm/aa-:"},{"$f":"IF('NO MIEMBROS'!E42>0,'NO MIEMBROS'!E42,\"INCOMPLETO RECHAZAR\")","v":"INCOMPLETO RECHAZAR"},572]
[{"$f":"+'NO MIEMBROS'!A43","v":"l NO MIEMBRO"},{"$f":"+'NO MIEMBROS'!B43","v":0},{"$f":"+'NO MIEMBROS'!C43","v":0},{"$f":"+'NO MIEMBROS'!D43","v":"LUGAR DE NACIMIENTO:"},{"$f":"IF('NO MIEMBROS'!E43>0,'NO MIEMBROS'!E43,\"INCOMPLETO RECHAZAR\")","v":"INCOMPLETO RECHAZAR"},573]
[{"$f":"+'NO MIEMBROS'!A44","v":"l NO MIEMBRO"},{"$f":"+'NO MIEMBROS'!B44","v":0},{"$f":"+'NO MIEMBROS'!C44","v":0},{"$f":"+'NO MIEMBROS'!D44","v":"NACIONALIDAD:"},{"$f":"IF('NO MIEMBROS'!E44>0,'NO MIEMBROS'!E44,\"INCOMPLETO RECHAZAR\")","v":"INCOMPLETO RECHAZAR"},574]
[{"$f":"+'NO MIEMBROS'!A51","v":"l NO MIEMBRO"},{"$f":"+'NO MIEMBROS'!B51","v":0},{"$f":"+'NO MIEMBROS'!C51","v":0},{"$f":"+'NO MIEMBROS'!D51","v":""},{"$f":"IF('NO MIEMBROS'!E51>0,'NO MIEMBROS'!E51,\"INCOMPLETO RECHAZAR\")","v":"INCOMPLETO RECHAZAR"},575]
[{"$f":"+'NO MIEMBROS'!A55","v":"l NO MIEMBRO"},{"$f":"+'NO MIEMBROS'!B55","v":0},{"$f":"+'NO MIEMBROS'!C55","v":0},{"$f":"+'NO MIEMBROS'!D55","v":"NOTA/OBSERVACIÓN -en mayúscula-:"},{"$f":"IF('NO MIEMBROS'!E55>0,'NO MIEMBROS'!E55,\"INCOMPLETO RECHAZAR\")","v":"INCOMPLETO RECHAZAR"},576]
[{"$f":"+'NO MIEMBROS'!A45","v":"l NO MIEMBRO"},{"$f":"+'NO MIEMBROS'!B45","v":0},{"$f":"+'NO MIEMBROS'!C45","v":0},{"$f":"+'NO MIEMBROS'!D45","v":"PROFESIÓN/OFICIO:"},{"$f":"IF('NO MIEMBROS'!E45>0,'NO MIEMBROS'!E45,\"INCOMPLETO RECHAZAR\")","v":"INCOMPLETO RECHAZAR"},577]
[{"$f":"+'NO MIEMBROS'!A66","v":"l NO MIEMBRO"},{"$f":"+'NO MIEMBROS'!B66","v":0},{"$f":"+'NO MIEMBROS'!C66","v":0},{"$f":"+'NO MIEMBROS'!D66","v":""},{"$f":"IF('NO MIEMBROS'!E66>0,'NO MIEMBROS'!E66,\"INCOMPLETO RECHAZAR\")","v":"INCOMPLETO RECHAZAR"},578]
[{"$f":"+'NO MIEMBROS'!A63","v":"l NO MIEMBRO"},{"$f":"+'NO MIEMBROS'!B63","v":0},{"$f":"+'NO MIEMBROS'!C63","v":0},{"$f":"+'NO MIEMBROS'!D63","v":"CEL/TEL :"},{"$f":"IF('NO MIEMBROS'!E63>0,'NO MIEMBROS'!E63,\"INCOMPLETO RECHAZAR\")","v":"INCOMPLETO RECHAZAR"},579]
[{"$f":"+'NO MIEMBROS'!A57","v":"l NO MIEMBRO"},{"$f":"+'NO MIEMBROS'!B57","v":0},{"$f":"+'NO MIEMBROS'!C57","v":0},{"$f":"+'NO MIEMBROS'!D57","v":"CUIT/CUIL –sin puntos ni barras-:"},{"$f":"IF('NO MIEMBROS'!E57>0,'NO MIEMBROS'!E57,\"INCOMPLETO RECHAZAR\")","v":"INCOMPLETO RECHAZAR"},580]
[{"$f":"+'NO MIEMBROS'!A68","v":"l NO MIEMBRO"},{"$f":"+'NO MIEMBROS'!B68","v":0},{"$f":"+'NO MIEMBROS'!C68","v":0},{"$f":"+'NO MIEMBROS'!D68","v":""},{"$f":"IF('NO MIEMBROS'!E68>0,'NO MIEMBROS'!E68,\"INCOMPLETO RECHAZAR\")","v":"INCOMPLETO RECHAZAR"},581]
[{"$f":"+'NO MIEMBROS'!A56","v":"l NO MIEMBRO"},{"$f":"+'NO MIEMBROS'!B56","v":0},{"$f":"+'NO MIEMBROS'!C56","v":0},{"$f":"+'NO MIEMBROS'!D56","v":"DOC. IDENTIDAD –sin puntos-:"},{"$f":"IF('NO MIEMBROS'!E56>0,'NO MIEMBROS'!E56,\"INCOMPLETO RECHAZAR\")","v":"INCOMPLETO RECHAZAR"},582]
[{"$f":"+'NO MIEMBROS'!A62","v":"l NO MIEMBRO"},{"$f":"+'NO MIEMBROS'!B62","v":0},{"$f":"+'NO MIEMBROS'!C62","v":0},{"$f":"+'NO MIEMBROS'!D62","v":"DOMICILIO REAL:"},{"$f":"IF('NO MIEMBROS'!E62>0,'NO MIEMBROS'!E62,\"INCOMPLETO RECHAZAR\")","v":"INCOMPLETO RECHAZAR"},583]
[{"$f":"+'NO MIEMBROS'!A65","v":"l NO MIEMBRO"},{"$f":"+'NO MIEMBROS'!B65","v":0},{"$f":"+'NO MIEMBROS'!C65","v":0},{"$f":"+'NO MIEMBROS'!D65","v":"ESTADO CIVIL:"},{"$f":"IF('NO MIEMBROS'!E65>0,'NO MIEMBROS'!E65,\"INCOMPLETO RECHAZAR\")","v":"INCOMPLETO RECHAZAR"},584]
[{"$f":"+'NO MIEMBROS'!A58","v":"l NO MIEMBRO"},{"$f":"+'NO MIEMBROS'!B58","v":0},{"$f":"+'NO MIEMBROS'!C58","v":0},{"$f":"+'NO MIEMBROS'!D58","v":"FECHA DE NACIMIENTO –dd/mm/aa-:"},{"$f":"IF('NO MIEMBROS'!E58>0,'NO MIEMBROS'!E58,\"INCOMPLETO RECHAZAR\")","v":"INCOMPLETO RECHAZAR"},585]
[{"$f":"+'NO MIEMBROS'!A59","v":"l NO MIEMBRO"},{"$f":"+'NO MIEMBROS'!B59","v":0},{"$f":"+'NO MIEMBROS'!C59","v":0},{"$f":"+'NO MIEMBROS'!D59","v":"LUGAR DE NACIMIENTO:"},{"$f":"IF('NO MIEMBROS'!E59>0,'NO MIEMBROS'!E59,\"INCOMPLETO RECHAZAR\")","v":"INCOMPLETO RECHAZAR"},586]
[{"$f":"+'NO MIEMBROS'!A60","v":"l NO MIEMBRO"},{"$f":"+'NO MIEMBROS'!B60","v":0},{"$f":"+'NO MIEMBROS'!C60","v":0},{"$f":"+'NO MIEMBROS'!D60","v":"NACIONALIDAD:"},{"$f":"IF('NO MIEMBROS'!E60>0,'NO MIEMBROS'!E60,\"INCOMPLETO RECHAZAR\")","v":"INCOMPLETO RECHAZAR"},587]
[{"$f":"+'NO MIEMBROS'!A67","v":"l NO MIEMBRO"},{"$f":"+'NO MIEMBROS'!B67","v":0},{"$f":"+'NO MIEMBROS'!C67","v":0},{"$f":"+'NO MIEMBROS'!D67","v":""},{"$f":"IF('NO MIEMBROS'!E67>0,'NO MIEMBROS'!E67,\"INCOMPLETO RECHAZAR\")","v":"INCOMPLETO RECHAZAR"},588]
[{"$f":"+'NO MIEMBROS'!A71","v":"l NO MIEMBRO"},{"$f":"+'NO MIEMBROS'!B71","v":0},{"$f":"+'NO MIEMBROS'!C71","v":0},{"$f":"+'NO MIEMBROS'!D71","v":"NOTA/OBSERVACIÓN -en mayúscula-:"},{"$f":"IF('NO MIEMBROS'!E71>0,'NO MIEMBROS'!E71,\"INCOMPLETO RECHAZAR\")","v":"INCOMPLETO RECHAZAR"},589]
[{"$f":"+'NO MIEMBROS'!A61","v":"l NO MIEMBRO"},{"$f":"+'NO MIEMBROS'!B61","v":0},{"$f":"+'NO MIEMBROS'!C61","v":0},{"$f":"+'NO MIEMBROS'!D61","v":"PROFESIÓN/OFICIO:"},{"$f":"IF('NO MIEMBROS'!E61>0,'NO MIEMBROS'!E61,\"INCOMPLETO RECHAZAR\")","v":"INCOMPLETO RECHAZAR"},590]
[{"$f":"+'NO MIEMBROS'!A82","v":"l NO MIEMBRO"},{"$f":"+'NO MIEMBROS'!B82","v":0},{"$f":"+'NO MIEMBROS'!C82","v":0},{"$f":"+'NO MIEMBROS'!D82","v":""},{"$f":"IF('NO MIEMBROS'!E82>0,'NO MIEMBROS'!E82,\"INCOMPLETO RECHAZAR\")","v":"INCOMPLETO RECHAZAR"},591]
[{"$f":"+'NO MIEMBROS'!A79","v":"l NO MIEMBRO"},{"$f":"+'NO MIEMBROS'!B79","v":0},{"$f":"+'NO MIEMBROS'!C79","v":0},{"$f":"+'NO MIEMBROS'!D79","v":"CEL/TEL :"},{"$f":"IF('NO MIEMBROS'!E79>0,'NO MIEMBROS'!E79,\"INCOMPLETO RECHAZAR\")","v":"INCOMPLETO RECHAZAR"},592]
[{"$f":"+'NO MIEMBROS'!A73","v":"l NO MIEMBRO"},{"$f":"+'NO MIEMBROS'!B73","v":0},{"$f":"+'NO MIEMBROS'!C73","v":0},{"$f":"+'NO MIEMBROS'!D73","v":"CUIT/CUIL –sin puntos ni barras-:"},{"$f":"IF('NO MIEMBROS'!E73>0,'NO MIEMBROS'!E73,\"INCOMPLETO RECHAZAR\")","v":"INCOMPLETO RECHAZAR"},593]
[{"$f":"+'NO MIEMBROS'!A84","v":"l NO MIEMBRO"},{"$f":"+'NO MIEMBROS'!B84","v":0},{"$f":"+'NO MIEMBROS'!C84","v":0},{"$f":"+'NO MIEMBROS'!D84","v":""},{"$f":"IF('NO MIEMBROS'!E84>0,'NO MIEMBROS'!E84,\"INCOMPLETO RECHAZAR\")","v":"INCOMPLETO RECHAZAR"},594]
[{"$f":"+'NO MIEMBROS'!A72","v":"l NO MIEMBRO"},{"$f":"+'NO MIEMBROS'!B72","v":0},{"$f":"+'NO MIEMBROS'!C72","v":0},{"$f":"+'NO MIEMBROS'!D72","v":"DOC. IDENTIDAD –sin puntos-:"},{"$f":"IF('NO MIEMBROS'!E72>0,'NO MIEMBROS'!E72,\"INCOMPLETO RECHAZAR\")","v":"INCOMPLETO RECHAZAR"},595]
[{"$f":"+'NO MIEMBROS'!A78","v":"l NO MIEMBRO"},{"$f":"+'NO MIEMBROS'!B78","v":0},{"$f":"+'NO MIEMBROS'!C78","v":0},{"$f":"+'NO MIEMBROS'!D78","v":"DOMICILIO REAL:"},{"$f":"IF('NO MIEMBROS'!E78>0,'NO MIEMBROS'!E78,\"INCOMPLETO RECHAZAR\")","v":"INCOMPLETO RECHAZAR"},596]
[{"$f":"+'NO MIEMBROS'!A81","v":"l NO MIEMBRO"},{"$f":"+'NO MIEMBROS'!B81","v":0},{"$f":"+'NO MIEMBROS'!C81","v":0},{"$f":"+'NO MIEMBROS'!D81","v":"ESTADO CIVIL:"},{"$f":"IF('NO MIEMBROS'!E81>0,'NO MIEMBROS'!E81,\"INCOMPLETO RECHAZAR\")","v":"INCOMPLETO RECHAZAR"},597]
[{"$f":"+'NO MIEMBROS'!A74","v":"l NO MIEMBRO"},{"$f":"+'NO MIEMBROS'!B74","v":0},{"$f":"+'NO MIEMBROS'!C74","v":0},{"$f":"+'NO MIEMBROS'!D74","v":"FECHA DE NACIMIENTO –dd/mm/aa-:"},{"$f":"IF('NO MIEMBROS'!E74>0,'NO MIEMBROS'!E74,\"INCOMPLETO RECHAZAR\")","v":"INCOMPLETO RECHAZAR"},598]
[{"$f":"+'NO MIEMBROS'!A75","v":"l NO MIEMBRO"},{"$f":"+'NO MIEMBROS'!B75","v":0},{"$f":"+'NO MIEMBROS'!C75","v":0},{"$f":"+'NO MIEMBROS'!D75","v":"LUGAR DE NACIMIENTO:"},{"$f":"IF('NO MIEMBROS'!E75>0,'NO MIEMBROS'!E75,\"INCOMPLETO RECHAZAR\")","v":"INCOMPLETO RECHAZAR"},599]
[{"$f":"+'NO MIEMBROS'!A76","v":"l NO MIEMBRO"},{"$f":"+'NO MIEMBROS'!B76","v":0},{"$f":"+'NO MIEMBROS'!C76","v":0},{"$f":"+'NO MIEMBROS'!D76","v":"NACIONALIDAD:"},{"$f":"IF('NO MIEMBROS'!E76>0,'NO MIEMBROS'!E76,\"INCOMPLETO RECHAZAR\")","v":"INCOMPLETO RECHAZAR"},600]
[{"$f":"+'NO MIEMBROS'!A83","v":"l NO MIEMBRO"},{"$f":"+'NO MIEMBROS'!B83","v":0},{"$f":"+'NO MIEMBROS'!C83","v":0},{"$f":"+'NO MIEMBROS'!D83","v":""},{"$f":"IF('NO MIEMBROS'!E83>0,'NO MIEMBROS'!E83,\"INCOMPLETO RECHAZAR\")","v":"INCOMPLETO RECHAZAR"},601]
[{"$f":"+'NO MIEMBROS'!A87","v":"l NO MIEMBRO"},{"$f":"+'NO MIEMBROS'!B87","v":0},{"$f":"+'NO MIEMBROS'!C87","v":0},{"$f":"+'NO MIEMBROS'!D87","v":"NOTA/OBSERVACIÓN -en mayúscula-:"},{"$f":"IF('NO MIEMBROS'!E87>0,'NO MIEMBROS'!E87,\"INCOMPLETO RECHAZAR\")","v":"INCOMPLETO RECHAZAR"},602]
[{"$f":"+'NO MIEMBROS'!A77","v":"l NO MIEMBRO"},{"$f":"+'NO MIEMBROS'!B77","v":0},{"$f":"+'NO MIEMBROS'!C77","v":0},{"$f":"+'NO MIEMBROS'!D77","v":"PROFESIÓN/OFICIO:"},{"$f":"IF('NO MIEMBROS'!E77>0,'NO MIEMBROS'!E77,\"INCOMPLETO RECHAZAR\")","v":"INCOMPLETO RECHAZAR"},603]
[{"$f":"+'NO MIEMBROS'!A98","v":"l NO MIEMBRO"},{"$f":"+'NO MIEMBROS'!B98","v":0},{"$f":"+'NO MIEMBROS'!C98","v":0},{"$f":"+'NO MIEMBROS'!D98","v":""},{"$f":"IF('NO MIEMBROS'!E98>0,'NO MIEMBROS'!E98,\"INCOMPLETO RECHAZAR\")","v":"INCOMPLETO RECHAZAR"},604]
[{"$f":"+'NO MIEMBROS'!A95","v":"l NO MIEMBRO"},{"$f":"+'NO MIEMBROS'!B95","v":0},{"$f":"+'NO MIEMBROS'!C95","v":0},{"$f":"+'NO MIEMBROS'!D95","v":"CEL/TEL :"},{"$f":"IF('NO MIEMBROS'!E95>0,'NO MIEMBROS'!E95,\"INCOMPLETO RECHAZAR\")","v":"INCOMPLETO RECHAZAR"},605]
[{"$f":"+'NO MIEMBROS'!A89","v":"l NO MIEMBRO"},{"$f":"+'NO MIEMBROS'!B89","v":0},{"$f":"+'NO MIEMBROS'!C89","v":0},{"$f":"+'NO MIEMBROS'!D89","v":"CUIT/CUIL –sin puntos ni barras-:"},{"$f":"IF('NO MIEMBROS'!E89>0,'NO MIEMBROS'!E89,\"INCOMPLETO RECHAZAR\")","v":"INCOMPLETO RECHAZAR"},606]
[{"$f":"+'NO MIEMBROS'!A100","v":"l NO MIEMBRO"},{"$f":"+'NO MIEMBROS'!B100","v":0},{"$f":"+'NO MIEMBROS'!C100","v":0},{"$f":"+'NO MIEMBROS'!D100","v":""},{"$f":"IF('NO MIEMBROS'!E100>0,'NO MIEMBROS'!E100,\"INCOMPLETO RECHAZAR\")","v":"INCOMPLETO RECHAZAR"},607]
[{"$f":"+'NO MIEMBROS'!A88","v":"l NO MIEMBRO"},{"$f":"+'NO MIEMBROS'!B88","v":0},{"$f":"+'NO MIEMBROS'!C88","v":0},{"$f":"+'NO MIEMBROS'!D88","v":"DOC. IDENTIDAD –sin puntos-:"},{"$f":"IF('NO MIEMBROS'!E88>0,'NO MIEMBROS'!E88,\"INCOMPLETO RECHAZAR\")","v":"INCOMPLETO RECHAZAR"},608]
[{"$f":"+'NO MIEMBROS'!A94","v":"l NO MIEMBRO"},{"$f":"+'NO MIEMBROS'!B94","v":0},{"$f":"+'NO MIEMBROS'!C94","v":0},{"$f":"+'NO MIEMBROS'!D94","v":"DOMICILIO REAL:"},{"$f":"IF('NO MIEMBROS'!E94>0,'NO MIEMBROS'!E94,\"INCOMPLETO RECHAZAR\")","v":"INCOMPLETO RECHAZAR"},609]
[{"$f":"+'NO MIEMBROS'!A97","v":"l NO MIEMBRO"},{"$f":"+'NO MIEMBROS'!B97","v":0},{"$f":"+'NO MIEMBROS'!C97","v":0},{"$f":"+'NO MIEMBROS'!D97","v":"ESTADO CIVIL:"},{"$f":"IF('NO MIEMBROS'!E97>0,'NO MIEMBROS'!E97,\"INCOMPLETO RECHAZAR\")","v":"INCOMPLETO RECHAZAR"},610]
[{"$f":"+'NO MIEMBROS'!A90","v":"l NO MIEMBRO"},{"$f":"+'NO MIEMBROS'!B90","v":0},{"$f":"+'NO MIEMBROS'!C90","v":0},{"$f":"+'NO MIEMBROS'!D90","v":"FECHA DE NACIMIENTO –dd/mm/aa-:"},{"$f":"IF('NO MIEMBROS'!E90>0,'NO MIEMBROS'!E90,\"INCOMPLETO RECHAZAR\")","v":"INCOMPLETO RECHAZAR"},611]
[{"$f":"+'NO MIEMBROS'!A91","v":"l NO MIEMBRO"},{"$f":"+'NO MIEMBROS'!B91","v":0},{"$f":"+'NO MIEMBROS'!C91","v":0},{"$f":"+'NO MIEMBROS'!D91","v":"LUGAR DE NACIMIENTO:"},{"$f":"IF('NO MIEMBROS'!E91>0,'NO MIEMBROS'!E91,\"INCOMPLETO RECHAZAR\")","v":"INCOMPLETO RECHAZAR"},612]
[{"$f":"+'NO MIEMBROS'!A92","v":"l NO MIEMBRO"},{"$f":"+'NO MIEMBROS'!B92","v":0},{"$f":"+'NO MIEMBROS'!C92","v":0},{"$f":"+'NO MIEMBROS'!D92","v":"NACIONALIDAD:"},{"$f":"IF('NO MIEMBROS'!E92>0,'NO MIEMBROS'!E92,\"INCOMPLETO RECHAZAR\")","v":"INCOMPLETO RECHAZAR"},613]
[{"$f":"+'NO MIEMBROS'!A99","v":"l NO MIEMBRO"},{"$f":"+'NO MIEMBROS'!B99","v":0},{"$f":"+'NO MIEMBROS'!C99","v":0},{"$f":"+'NO MIEMBROS'!D99","v":""},{"$f":"IF('NO MIEMBROS'!E99>0,'NO MIEMBROS'!E99,\"INCOMPLETO RECHAZAR\")","v":"INCOMPLETO RECHAZAR"},614]
[{"$f":"+'NO MIEMBROS'!A103","v":"l NO MIEMBRO"},{"$f":"+'NO MIEMBROS'!B103","v":0},{"$f":"+'NO MIEMBROS'!C103","v":0},{"$f":"+'NO MIEMBROS'!D103","v":"NOTA/OBSERVACIÓN -en mayúscula-:"},{"$f":"IF('NO MIEMBROS'!E103>0,'NO MIEMBROS'!E103,\"INCOMPLETO RECHAZAR\")","v":"INCOMPLETO RECHAZAR"},615]
[{"$f":"+'NO MIEMBROS'!A93","v":"l NO MIEMBRO"},{"$f":"+'NO MIEMBROS'!B93","v":0},{"$f":"+'NO MIEMBROS'!C93","v":0},{"$f":"+'NO MIEMBROS'!D93","v":"PROFESIÓN/OFICIO:"},{"$f":"IF('NO MIEMBROS'!E93>0,'NO MIEMBROS'!E93,\"INCOMPLETO RECHAZAR\")","v":"INCOMPLETO RECHAZAR"},616]
[{"$f":"+'NO MIEMBROS'!A114","v":"l NO MIEMBRO"},{"$f":"+'NO MIEMBROS'!B114","v":0},{"$f":"+'NO MIEMBROS'!C114","v":0},{"$f":"+'NO MIEMBROS'!D114","v":""},{"$f":"IF('NO MIEMBROS'!E114>0,'NO MIEMBROS'!E114,\"INCOMPLETO RECHAZAR\")","v":"INCOMPLETO RECHAZAR"},617]
[{"$f":"+'NO MIEMBROS'!A111","v":"l NO MIEMBRO"},{"$f":"+'NO MIEMBROS'!B111","v":0},{"$f":"+'NO MIEMBROS'!C111","v":0},{"$f":"+'NO MIEMBROS'!D111","v":"CEL/TEL :"},{"$f":"IF('NO MIEMBROS'!E111>0,'NO MIEMBROS'!E111,\"INCOMPLETO RECHAZAR\")","v":"INCOMPLETO RECHAZAR"},618]
[{"$f":"+'NO MIEMBROS'!A105","v":"l NO MIEMBRO"},{"$f":"+'NO MIEMBROS'!B105","v":0},{"$f":"+'NO MIEMBROS'!C105","v":0},{"$f":"+'NO MIEMBROS'!D105","v":"CUIT/CUIL –sin puntos ni barras-:"},{"$f":"IF('NO MIEMBROS'!E105>0,'NO MIEMBROS'!E105,\"INCOMPLETO RECHAZAR\")","v":"INCOMPLETO RECHAZAR"},619]
[{"$f":"+'NO MIEMBROS'!A116","v":"l NO MIEMBRO"},{"$f":"+'NO MIEMBROS'!B116","v":0},{"$f":"+'NO MIEMBROS'!C116","v":0},{"$f":"+'NO MIEMBROS'!D116","v":""},{"$f":"IF('NO MIEMBROS'!E116>0,'NO MIEMBROS'!E116,\"INCOMPLETO RECHAZAR\")","v":"INCOMPLETO RECHAZAR"},620]
[{"$f":"+'NO MIEMBROS'!A104","v":"l NO MIEMBRO"},{"$f":"+'NO MIEMBROS'!B104","v":0},{"$f":"+'NO MIEMBROS'!C104","v":0},{"$f":"+'NO MIEMBROS'!D104","v":"DOC. IDENTIDAD –sin puntos-:"},{"$f":"IF('NO MIEMBROS'!E104>0,'NO MIEMBROS'!E104,\"INCOMPLETO RECHAZAR\")","v":"INCOMPLETO RECHAZAR"},621]
[{"$f":"+'NO MIEMBROS'!A110","v":"l NO MIEMBRO"},{"$f":"+'NO MIEMBROS'!B110","v":0},{"$f":"+'NO MIEMBROS'!C110","v":0},{"$f":"+'NO MIEMBROS'!D110","v":"DOMICILIO REAL:"},{"$f":"IF('NO MIEMBROS'!E110>0,'NO MIEMBROS'!E110,\"INCOMPLETO RECHAZAR\")","v":"INCOMPLETO RECHAZAR"},622]
[{"$f":"+'NO MIEMBROS'!A113","v":"l NO MIEMBRO"},{"$f":"+'NO MIEMBROS'!B113","v":0},{"$f":"+'NO MIEMBROS'!C113","v":0},{"$f":"+'NO MIEMBROS'!D113","v":"ESTADO CIVIL:"},{"$f":"IF('NO MIEMBROS'!E113>0,'NO MIEMBROS'!E113,\"INCOMPLETO RECHAZAR\")","v":"INCOMPLETO RECHAZAR"},623]
[{"$f":"+'NO MIEMBROS'!A106","v":"l NO MIEMBRO"},{"$f":"+'NO MIEMBROS'!B106","v":0},{"$f":"+'NO MIEMBROS'!C106","v":0},{"$f":"+'NO MIEMBROS'!D106","v":"FECHA DE NACIMIENTO –dd/mm/aa-:"},{"$f":"IF('NO MIEMBROS'!E106>0,'NO MIEMBROS'!E106,\"INCOMPLETO RECHAZAR\")","v":"INCOMPLETO RECHAZAR"},624]
[{"$f":"+'NO MIEMBROS'!A107","v":"l NO MIEMBRO"},{"$f":"+'NO MIEMBROS'!B107","v":0},{"$f":"+'NO MIEMBROS'!C107","v":0},{"$f":"+'NO MIEMBROS'!D107","v":"LUGAR DE NACIMIENTO:"},{"$f":"IF('NO MIEMBROS'!E107>0,'NO MIEMBROS'!E107,\"INCOMPLETO RECHAZAR\")","v":"INCOMPLETO RECHAZAR"},625]
[{"$f":"+'NO MIEMBROS'!A108","v":"l NO MIEMBRO"},{"$f":"+'NO MIEMBROS'!B108","v":0},{"$f":"+'NO MIEMBROS'!C108","v":0},{"$f":"+'NO MIEMBROS'!D108","v":"NACIONALIDAD:"},{"$f":"IF('NO MIEMBROS'!E108>0,'NO MIEMBROS'!E108,\"INCOMPLETO RECHAZAR\")","v":"INCOMPLETO RECHAZAR"},626]
[{"$f":"+'NO MIEMBROS'!A115","v":"l NO MIEMBRO"},{"$f":"+'NO MIEMBROS'!B115","v":0},{"$f":"+'NO MIEMBROS'!C115","v":0},{"$f":"+'NO MIEMBROS'!D115","v":""},{"$f":"IF('NO MIEMBROS'!E115>0,'NO MIEMBROS'!E115,\"INCOMPLETO RECHAZAR\")","v":"INCOMPLETO RECHAZAR"},627]
[{"$f":"+'NO MIEMBROS'!A119","v":"l NO MIEMBRO"},{"$f":"+'NO MIEMBROS'!B119","v":0},{"$f":"+'NO MIEMBROS'!C119","v":0},{"$f":"+'NO MIEMBROS'!D119","v":"NOTA/OBSERVACIÓN -en mayúscula-:"},{"$f":"IF('NO MIEMBROS'!E119>0,'NO MIEMBROS'!E119,\"INCOMPLETO RECHAZAR\")","v":"INCOMPLETO RECHAZAR"},628]
[{"$f":"+'NO MIEMBROS'!A109","v":"l NO MIEMBRO"},{"$f":"+'NO MIEMBROS'!B109","v":0},{"$f":"+'NO MIEMBROS'!C109","v":0},{"$f":"+'NO MIEMBROS'!D109","v":"PROFESIÓN/OFICIO:"},{"$f":"IF('NO MIEMBROS'!E109>0,'NO MIEMBROS'!E109,\"INCOMPLETO RECHAZAR\")","v":"INCOMPLETO RECHAZAR"},629]
[{"$f":"+'NO MIEMBROS'!A130","v":"l NO MIEMBRO"},{"$f":"+'NO MIEMBROS'!B130","v":0},{"$f":"+'NO MIEMBROS'!C130","v":0},{"$f":"+'NO MIEMBROS'!D130","v":""},{"$f":"IF('NO MIEMBROS'!E130>0,'NO MIEMBROS'!E130,\"INCOMPLETO RECHAZAR\")","v":"INCOMPLETO RECHAZAR"},630]
[{"$f":"+'NO MIEMBROS'!A127","v":"l NO MIEMBRO"},{"$f":"+'NO MIEMBROS'!B127","v":0},{"$f":"+'NO MIEMBROS'!C127","v":0},{"$f":"+'NO MIEMBROS'!D127","v":"CEL/TEL :"},{"$f":"IF('NO MIEMBROS'!E127>0,'NO MIEMBROS'!E127,\"INCOMPLETO RECHAZAR\")","v":"INCOMPLETO RECHAZAR"},631]
[{"$f":"+'NO MIEMBROS'!A121","v":"l NO MIEMBRO"},{"$f":"+'NO MIEMBROS'!B121","v":0},{"$f":"+'NO MIEMBROS'!C121","v":0},{"$f":"+'NO MIEMBROS'!D121","v":"CUIT/CUIL –sin puntos ni barras-:"},{"$f":"IF('NO MIEMBROS'!E121>0,'NO MIEMBROS'!E121,\"INCOMPLETO RECHAZAR\")","v":"INCOMPLETO RECHAZAR"},632]
[{"$f":"+'NO MIEMBROS'!A132","v":"l NO MIEMBRO"},{"$f":"+'NO MIEMBROS'!B132","v":0},{"$f":"+'NO MIEMBROS'!C132","v":0},{"$f":"+'NO MIEMBROS'!D132","v":""},{"$f":"IF('NO MIEMBROS'!E132>0,'NO MIEMBROS'!E132,\"INCOMPLETO RECHAZAR\")","v":"INCOMPLETO RECHAZAR"},633]
[{"$f":"+'NO MIEMBROS'!A120","v":"l NO MIEMBRO"},{"$f":"+'NO MIEMBROS'!B120","v":0},{"$f":"+'NO MIEMBROS'!C120","v":0},{"$f":"+'NO MIEMBROS'!D120","v":"DOC. IDENTIDAD –sin puntos-:"},{"$f":"IF('NO MIEMBROS'!E120>0,'NO MIEMBROS'!E120,\"INCOMPLETO RECHAZAR\")","v":"INCOMPLETO RECHAZAR"},634]
[{"$f":"+'NO MIEMBROS'!A126","v":"l NO MIEMBRO"},{"$f":"+'NO MIEMBROS'!B126","v":0},{"$f":"+'NO MIEMBROS'!C126","v":0},{"$f":"+'NO MIEMBROS'!D126","v":"DOMICILIO REAL:"},{"$f":"IF('NO MIEMBROS'!E126>0,'NO MIEMBROS'!E126,\"INCOMPLETO RECHAZAR\")","v":"INCOMPLETO RECHAZAR"},635]
[{"$f":"+'NO MIEMBROS'!A129","v":"l NO MIEMBRO"},{"$f":"+'NO MIEMBROS'!B129","v":0},{"$f":"+'NO MIEMBROS'!C129","v":0},{"$f":"+'NO MIEMBROS'!D129","v":"ESTADO CIVIL:"},{"$f":"IF('NO MIEMBROS'!E129>0,'NO MIEMBROS'!E129,\"INCOMPLETO RECHAZAR\")","v":"INCOMPLETO RECHAZAR"},636]
[{"$f":"+'NO MIEMBROS'!A122","v":"l NO MIEMBRO"},{"$f":"+'NO MIEMBROS'!B122","v":0},{"$f":"+'NO MIEMBROS'!C122","v":0},{"$f":"+'NO MIEMBROS'!D122","v":"FECHA DE NACIMIENTO –dd/mm/aa-:"},{"$f":"IF('NO MIEMBROS'!E122>0,'NO MIEMBROS'!E122,\"INCOMPLETO RECHAZAR\")","v":"INCOMPLETO RECHAZAR"},637]
[{"$f":"+'NO MIEMBROS'!A123","v":"l NO MIEMBRO"},{"$f":"+'NO MIEMBROS'!B123","v":0},{"$f":"+'NO MIEMBROS'!C123","v":0},{"$f":"+'NO MIEMBROS'!D123","v":"LUGAR DE NACIMIENTO:"},{"$f":"IF('NO MIEMBROS'!E123>0,'NO MIEMBROS'!E123,\"INCOMPLETO RECHAZAR\")","v":"INCOMPLETO RECHAZAR"},638]
[{"$f":"+'NO MIEMBROS'!A124","v":"l NO MIEMBRO"},{"$f":"+'NO MIEMBROS'!B124","v":0},{"$f":"+'NO MIEMBROS'!C124","v":0},{"$f":"+'NO MIEMBROS'!D124","v":"NACIONALIDAD:"},{"$f":"IF('NO MIEMBROS'!E124>0,'NO MIEMBROS'!E124,\"INCOMPLETO RECHAZAR\")","v":"INCOMPLETO RECHAZAR"},639]
[{"$f":"+'NO MIEMBROS'!A131","v":"l NO MIEMBRO"},{"$f":"+'NO MIEMBROS'!B131","v":0},{"$f":"+'NO MIEMBROS'!C131","v":0},{"$f":"+'NO MIEMBROS'!D131","v":""},{"$f":"IF('NO MIEMBROS'!E131>0,'NO MIEMBROS'!E131,\"INCOMPLETO RECHAZAR\")","v":"INCOMPLETO RECHAZAR"},640]
[{"$f":"+'NO MIEMBROS'!A135","v":"l NO MIEMBRO"},{"$f":"+'NO MIEMBROS'!B135","v":0},{"$f":"+'NO MIEMBROS'!C135","v":0},{"$f":"+'NO MIEMBROS'!D135","v":"NOTA/OBSERVACIÓN -en mayúscula-:"},{"$f":"IF('NO MIEMBROS'!E135>0,'NO MIEMBROS'!E135,\"INCOMPLETO RECHAZAR\")","v":"INCOMPLETO RECHAZAR"},641]
[{"$f":"+'NO MIEMBROS'!A125","v":"l NO MIEMBRO"},{"$f":"+'NO MIEMBROS'!B125","v":0},{"$f":"+'NO MIEMBROS'!C125","v":0},{"$f":"+'NO MIEMBROS'!D125","v":"PROFESIÓN/OFICIO:"},{"$f":"IF('NO MIEMBROS'!E125>0,'NO MIEMBROS'!E125,\"INCOMPLETO RECHAZAR\")","v":"INCOMPLETO RECHAZAR"},642]
[{"$f":"+'NO MIEMBROS'!A146","v":"l NO MIEMBRO"},{"$f":"+'NO MIEMBROS'!B146","v":0},{"$f":"+'NO MIEMBROS'!C146","v":0},{"$f":"+'NO MIEMBROS'!D146","v":""},{"$f":"IF('NO MIEMBROS'!E146>0,'NO MIEMBROS'!E146,\"INCOMPLETO RECHAZAR\")","v":"INCOMPLETO RECHAZAR"},643]
[{"$f":"+'NO MIEMBROS'!A143","v":"l NO MIEMBRO"},{"$f":"+'NO MIEMBROS'!B143","v":0},{"$f":"+'NO MIEMBROS'!C143","v":0},{"$f":"+'NO MIEMBROS'!D143","v":"CEL/TEL :"},{"$f":"IF('NO MIEMBROS'!E143>0,'NO MIEMBROS'!E143,\"INCOMPLETO RECHAZAR\")","v":"INCOMPLETO RECHAZAR"},644]
[{"$f":"+'NO MIEMBROS'!A137","v":"l NO MIEMBRO"},{"$f":"+'NO MIEMBROS'!B137","v":0},{"$f":"+'NO MIEMBROS'!C137","v":0},{"$f":"+'NO MIEMBROS'!D137","v":"CUIT/CUIL –sin puntos ni barras-:"},{"$f":"IF('NO MIEMBROS'!E137>0,'NO MIEMBROS'!E137,\"INCOMPLETO RECHAZAR\")","v":"INCOMPLETO RECHAZAR"},645]
[{"$f":"+'NO MIEMBROS'!A148","v":"l NO MIEMBRO"},{"$f":"+'NO MIEMBROS'!B148","v":0},{"$f":"+'NO MIEMBROS'!C148","v":0},{"$f":"+'NO MIEMBROS'!D148","v":""},{"$f":"IF('NO MIEMBROS'!E148>0,'NO MIEMBROS'!E148,\"INCOMPLETO RECHAZAR\")","v":"INCOMPLETO RECHAZAR"},646]
[{"$f":"+'NO MIEMBROS'!A136","v":"l NO MIEMBRO"},{"$f":"+'NO MIEMBROS'!B136","v":0},{"$f":"+'NO MIEMBROS'!C136","v":0},{"$f":"+'NO MIEMBROS'!D136","v":"DOC. IDENTIDAD –sin puntos-:"},{"$f":"IF('NO MIEMBROS'!E136>0,'NO MIEMBROS'!E136,\"INCOMPLETO RECHAZAR\")","v":"INCOMPLETO RECHAZAR"},647]
[{"$f":"+'NO MIEMBROS'!A142","v":"l NO MIEMBRO"},{"$f":"+'NO MIEMBROS'!B142","v":0},{"$f":"+'NO MIEMBROS'!C142","v":0},{"$f":"+'NO MIEMBROS'!D142","v":"DOMICILIO REAL:"},{"$f":"IF('NO MIEMBROS'!E142>0,'NO MIEMBROS'!E142,\"INCOMPLETO RECHAZAR\")","v":"INCOMPLETO RECHAZAR"},648]
[{"$f":"+'NO MIEMBROS'!A145","v":"l NO MIEMBRO"},{"$f":"+'NO MIEMBROS'!B145","v":0},{"$f":"+'NO MIEMBROS'!C145","v":0},{"$f":"+'NO MIEMBROS'!D145","v":"ESTADO CIVIL:"},{"$f":"IF('NO MIEMBROS'!E145>0,'NO MIEMBROS'!E145,\"INCOMPLETO RECHAZAR\")","v":"INCOMPLETO RECHAZAR"},649]
[{"$f":"+'NO MIEMBROS'!A138","v":"l NO MIEMBRO"},{"$f":"+'NO MIEMBROS'!B138","v":0},{"$f":"+'NO MIEMBROS'!C138","v":0},{"$f":"+'NO MIEMBROS'!D138","v":"FECHA DE NACIMIENTO –dd/mm/aa-:"},{"$f":"IF('NO MIEMBROS'!E138>0,'NO MIEMBROS'!E138,\"INCOMPLETO RECHAZAR\")","v":"INCOMPLETO RECHAZAR"},650]
[{"$f":"+'NO MIEMBROS'!A139","v":"l NO MIEMBRO"},{"$f":"+'NO MIEMBROS'!B139","v":0},{"$f":"+'NO MIEMBROS'!C139","v":0},{"$f":"+'NO MIEMBROS'!D139","v":"LUGAR DE NACIMIENTO:"},{"$f":"IF('NO MIEMBROS'!E139>0,'NO MIEMBROS'!E139,\"INCOMPLETO RECHAZAR\")","v":"INCOMPLETO RECHAZAR"},651]
[{"$f":"+'NO MIEMBROS'!A140","v":"l NO MIEMBRO"},{"$f":"+'NO MIEMBROS'!B140","v":0},{"$f":"+'NO MIEMBROS'!C140","v":0},{"$f":"+'NO MIEMBROS'!D140","v":"NACIONALIDAD:"},{"$f":"IF('NO MIEMBROS'!E140>0,'NO MIEMBROS'!E140,\"INCOMPLETO RECHAZAR\")","v":"INCOMPLETO RECHAZAR"},652]
[{"$f":"+'NO MIEMBROS'!A147","v":"l NO MIEMBRO"},{"$f":"+'NO MIEMBROS'!B147","v":0},{"$f":"+'NO MIEMBROS'!C147","v":0},{"$f":"+'NO MIEMBROS'!D147","v":""},{"$f":"IF('NO MIEMBROS'!E147>0,'NO MIEMBROS'!E147,\"INCOMPLETO RECHAZAR\")","v":"INCOMPLETO RECHAZAR"},653]
[{"$f":"+'NO MIEMBROS'!A151","v":"l NO MIEMBRO"},{"$f":"+'NO MIEMBROS'!B151","v":0},{"$f":"+'NO MIEMBROS'!C151","v":0},{"$f":"+'NO MIEMBROS'!D151","v":"NOTA/OBSERVACIÓN -en mayúscula-:"},{"$f":"IF('NO MIEMBROS'!E151>0,'NO MIEMBROS'!E151,\"INCOMPLETO RECHAZAR\")","v":"INCOMPLETO RECHAZAR"},654]
[{"$f":"+'NO MIEMBROS'!A141","v":"l NO MIEMBRO"},{"$f":"+'NO MIEMBROS'!B141","v":0},{"$f":"+'NO MIEMBROS'!C141","v":0},{"$f":"+'NO MIEMBROS'!D141","v":"PROFESIÓN/OFICIO:"},{"$f":"IF('NO MIEMBROS'!E141>0,'NO MIEMBROS'!E141,\"INCOMPLETO RECHAZAR\")","v":"INCOMPLETO RECHAZAR"},655]
[{"$f":"+'NO MIEMBROS'!A162","v":"l NO MIEMBRO"},{"$f":"+'NO MIEMBROS'!B162","v":0},{"$f":"+'NO MIEMBROS'!C162","v":0},{"$f":"+'NO MIEMBROS'!D162","v":""},{"$f":"IF('NO MIEMBROS'!E162>0,'NO MIEMBROS'!E162,\"INCOMPLETO RECHAZAR\")","v":"INCOMPLETO RECHAZAR"},656]
[{"$f":"+'NO MIEMBROS'!A159","v":"l NO MIEMBRO"},{"$f":"+'NO MIEMBROS'!B159","v":0},{"$f":"+'NO MIEMBROS'!C159","v":0},{"$f":"+'NO MIEMBROS'!D159","v":"CEL/TEL :"},{"$f":"IF('NO MIEMBROS'!E159>0,'NO MIEMBROS'!E159,\"INCOMPLETO RECHAZAR\")","v":"INCOMPLETO RECHAZAR"},657]
[{"$f":"+'NO MIEMBROS'!A153","v":"l NO MIEMBRO"},{"$f":"+'NO MIEMBROS'!B153","v":0},{"$f":"+'NO MIEMBROS'!C153","v":0},{"$f":"+'NO MIEMBROS'!D153","v":"CUIT/CUIL –sin puntos ni barras-:"},{"$f":"IF('NO MIEMBROS'!E153>0,'NO MIEMBROS'!E153,\"INCOMPLETO RECHAZAR\")","v":"INCOMPLETO RECHAZAR"},658]
[{"$f":"+'NO MIEMBROS'!A164","v":"l NO MIEMBRO"},{"$f":"+'NO MIEMBROS'!B164","v":0},{"$f":"+'NO MIEMBROS'!C164","v":0},{"$f":"+'NO MIEMBROS'!D164","v":""},{"$f":"IF('NO MIEMBROS'!E164>0,'NO MIEMBROS'!E164,\"INCOMPLETO RECHAZAR\")","v":"INCOMPLETO RECHAZAR"},659]
[{"$f":"+'NO MIEMBROS'!A152","v":"l NO MIEMBRO"},{"$f":"+'NO MIEMBROS'!B152","v":0},{"$f":"+'NO MIEMBROS'!C152","v":0},{"$f":"+'NO MIEMBROS'!D152","v":"DOC. IDENTIDAD –sin puntos-:"},{"$f":"IF('NO MIEMBROS'!E152>0,'NO MIEMBROS'!E152,\"INCOMPLETO RECHAZAR\")","v":"INCOMPLETO RECHAZAR"},660]
[{"$f":"+'NO MIEMBROS'!A158","v":"l NO MIEMBRO"},{"$f":"+'NO MIEMBROS'!B158","v":0},{"$f":"+'NO MIEMBROS'!C158","v":0},{"$f":"+'NO MIEMBROS'!D158","v":"DOMICILIO REAL:"},{"$f":"IF('NO MIEMBROS'!E158>0,'NO MIEMBROS'!E158,\"INCOMPLETO RECHAZAR\")","v":"INCOMPLETO RECHAZAR"},661]
[{"$f":"+'NO MIEMBROS'!A161","v":"l NO MIEMBRO"},{"$f":"+'NO MIEMBROS'!B161","v":0},{"$f":"+'NO MIEMBROS'!C161","v":0},{"$f":"+'NO MIEMBROS'!D161","v":"ESTADO CIVIL:"},{"$f":"IF('NO MIEMBROS'!E161>0,'NO MIEMBROS'!E161,\"INCOMPLETO RECHAZAR\")","v":"INCOMPLETO RECHAZAR"},662]
[{"$f":"+'NO MIEMBROS'!A154","v":"l NO MIEMBRO"},{"$f":"+'NO MIEMBROS'!B154","v":0},{"$f":"+'NO MIEMBROS'!C154","v":0},{"$f":"+'NO MIEMBROS'!D154","v":"FECHA DE NACIMIENTO –dd/mm/aa-:"},{"$f":"IF('NO MIEMBROS'!E154>0,'NO MIEMBROS'!E154,\"INCOMPLETO RECHAZAR\")","v":"INCOMPLETO RECHAZAR"},663]
[{"$f":"+'NO MIEMBROS'!A155","v":"l NO MIEMBRO"},{"$f":"+'NO MIEMBROS'!B155","v":0},{"$f":"+'NO MIEMBROS'!C155","v":0},{"$f":"+'NO MIEMBROS'!D155","v":"LUGAR DE NACIMIENTO:"},{"$f":"IF('NO MIEMBROS'!E155>0,'NO MIEMBROS'!E155,\"INCOMPLETO RECHAZAR\")","v":"INCOMPLETO RECHAZAR"},664]
[{"$f":"+'NO MIEMBROS'!A156","v":"l NO MIEMBRO"},{"$f":"+'NO MIEMBROS'!B156","v":0},{"$f":"+'NO MIEMBROS'!C156","v":0},{"$f":"+'NO MIEMBROS'!D156","v":"NACIONALIDAD:"},{"$f":"IF('NO MIEMBROS'!E156>0,'NO MIEMBROS'!E156,\"INCOMPLETO RECHAZAR\")","v":"INCOMPLETO RECHAZAR"},665]
[{"$f":"+'NO MIEMBROS'!A163","v":"l NO MIEMBRO"},{"$f":"+'NO MIEMBROS'!B163","v":0},{"$f":"+'NO MIEMBROS'!C163","v":0},{"$f":"+'NO MIEMBROS'!D163","v":""},{"$f":"IF('NO MIEMBROS'!E163>0,'NO MIEMBROS'!E163,\"INCOMPLETO RECHAZAR\")","v":"INCOMPLETO RECHAZAR"},666]
[{"$f":"+'NO MIEMBROS'!A167","v":"l NO MIEMBRO"},{"$f":"+'NO MIEMBROS'!B167","v":0},{"$f":"+'NO MIEMBROS'!C167","v":0},{"$f":"+'NO MIEMBROS'!D167","v":"NOTA/OBSERVACIÓN -en mayúscula-:"},{"$f":"IF('NO MIEMBROS'!E167>0,'NO MIEMBROS'!E167,\"INCOMPLETO RECHAZAR\")","v":"INCOMPLETO RECHAZAR"},667]
[{"$f":"+'NO MIEMBROS'!A157","v":"l NO MIEMBRO"},{"$f":"+'NO MIEMBROS'!B157","v":0},{"$f":"+'NO MIEMBROS'!C157","v":0},{"$f":"+'NO MIEMBROS'!D157","v":"PROFESIÓN/OFICIO:"},{"$f":"IF('NO MIEMBROS'!E157>0,'NO MIEMBROS'!E157,\"INCOMPLETO RECHAZAR\")","v":"INCOMPLETO RECHAZAR"},668]
[{"$f":"+'NO MIEMBROS'!A178","v":"l NO MIEMBRO"},{"$f":"+'NO MIEMBROS'!B178","v":0},{"$f":"+'NO MIEMBROS'!C178","v":0},{"$f":"+'NO MIEMBROS'!D178","v":""},{"$f":"IF('NO MIEMBROS'!E178>0,'NO MIEMBROS'!E178,\"INCOMPLETO RECHAZAR\")","v":"INCOMPLETO RECHAZAR"},669]
[{"$f":"+'NO MIEMBROS'!A175","v":"l NO MIEMBRO"},{"$f":"+'NO MIEMBROS'!B175","v":0},{"$f":"+'NO MIEMBROS'!C175","v":0},{"$f":"+'NO MIEMBROS'!D175","v":"CEL/TEL :"},{"$f":"IF('NO MIEMBROS'!E175>0,'NO MIEMBROS'!E175,\"INCOMPLETO RECHAZAR\")","v":"INCOMPLETO RECHAZAR"},670]
[{"$f":"+'NO MIEMBROS'!A169","v":"l NO MIEMBRO"},{"$f":"+'NO MIEMBROS'!B169","v":0},{"$f":"+'NO MIEMBROS'!C169","v":0},{"$f":"+'NO MIEMBROS'!D169","v":"CUIT/CUIL –sin puntos ni barras-:"},{"$f":"IF('NO MIEMBROS'!E169>0,'NO MIEMBROS'!E169,\"INCOMPLETO RECHAZAR\")","v":"INCOMPLETO RECHAZAR"},671]
[{"$f":"+'NO MIEMBROS'!A180","v":"l NO MIEMBRO"},{"$f":"+'NO MIEMBROS'!B180","v":0},{"$f":"+'NO MIEMBROS'!C180","v":0},{"$f":"+'NO MIEMBROS'!D180","v":""},{"$f":"IF('NO MIEMBROS'!E180>0,'NO MIEMBROS'!E180,\"INCOMPLETO RECHAZAR\")","v":"INCOMPLETO RECHAZAR"},672]
[{"$f":"+'NO MIEMBROS'!A168","v":"l NO MIEMBRO"},{"$f":"+'NO MIEMBROS'!B168","v":0},{"$f":"+'NO MIEMBROS'!C168","v":0},{"$f":"+'NO MIEMBROS'!D168","v":"DOC. IDENTIDAD –sin puntos-:"},{"$f":"IF('NO MIEMBROS'!E168>0,'NO MIEMBROS'!E168,\"INCOMPLETO RECHAZAR\")","v":"INCOMPLETO RECHAZAR"},673]
[{"$f":"+'NO MIEMBROS'!A174","v":"l NO MIEMBRO"},{"$f":"+'NO MIEMBROS'!B174","v":0},{"$f":"+'NO MIEMBROS'!C174","v":0},{"$f":"+'NO MIEMBROS'!D174","v":"DOMICILIO REAL:"},{"$f":"IF('NO MIEMBROS'!E174>0,'NO MIEMBROS'!E174,\"INCOMPLETO RECHAZAR\")","v":"INCOMPLETO RECHAZAR"},674]
[{"$f":"+'NO MIEMBROS'!A177","v":"l NO MIEMBRO"},{"$f":"+'NO MIEMBROS'!B177","v":0},{"$f":"+'NO MIEMBROS'!C177","v":0},{"$f":"+'NO MIEMBROS'!D177","v":"ESTADO CIVIL:"},{"$f":"IF('NO MIEMBROS'!E177>0,'NO MIEMBROS'!E177,\"INCOMPLETO RECHAZAR\")","v":"INCOMPLETO RECHAZAR"},675]
[{"$f":"+'NO MIEMBROS'!A170","v":"l NO MIEMBRO"},{"$f":"+'NO MIEMBROS'!B170","v":0},{"$f":"+'NO MIEMBROS'!C170","v":0},{"$f":"+'NO MIEMBROS'!D170","v":"FECHA DE NACIMIENTO –dd/mm/aa-:"},{"$f":"IF('NO MIEMBROS'!E170>0,'NO MIEMBROS'!E170,\"INCOMPLETO RECHAZAR\")","v":"INCOMPLETO RECHAZAR"},676]
[{"$f":"+'NO MIEMBROS'!A171","v":"l NO MIEMBRO"},{"$f":"+'NO MIEMBROS'!B171","v":0},{"$f":"+'NO MIEMBROS'!C171","v":0},{"$f":"+'NO MIEMBROS'!D171","v":"LUGAR DE NACIMIENTO:"},{"$f":"IF('NO MIEMBROS'!E171>0,'NO MIEMBROS'!E171,\"INCOMPLETO RECHAZAR\")","v":"INCOMPLETO RECHAZAR"},677]
[{"$f":"+'NO MIEMBROS'!A172","v":"l NO MIEMBRO"},{"$f":"+'NO MIEMBROS'!B172","v":0},{"$f":"+'NO MIEMBROS'!C172","v":0},{"$f":"+'NO MIEMBROS'!D172","v":"NACIONALIDAD:"},{"$f":"IF('NO MIEMBROS'!E172>0,'NO MIEMBROS'!E172,\"INCOMPLETO RECHAZAR\")","v":"INCOMPLETO RECHAZAR"},678]
[{"$f":"+'NO MIEMBROS'!A179","v":"l NO MIEMBRO"},{"$f":"+'NO MIEMBROS'!B179","v":0},{"$f":"+'NO MIEMBROS'!C179","v":0},{"$f":"+'NO MIEMBROS'!D179","v":""},{"$f":"IF('NO MIEMBROS'!E179>0,'NO MIEMBROS'!E179,\"INCOMPLETO RECHAZAR\")","v":"INCOMPLETO RECHAZAR"},679]
[{"$f":"+'NO MIEMBROS'!A183","v":"l NO MIEMBRO"},{"$f":"+'NO MIEMBROS'!B183","v":0},{"$f":"+'NO MIEMBROS'!C183","v":0},{"$f":"+'NO MIEMBROS'!D183","v":"NOTA/OBSERVACIÓN -en mayúscula-:"},{"$f":"IF('NO MIEMBROS'!E183>0,'NO MIEMBROS'!E183,\"INCOMPLETO RECHAZAR\")","v":"INCOMPLETO RECHAZAR"},680]
[{"$f":"+'NO MIEMBROS'!A173","v":"l NO MIEMBRO"},{"$f":"+'NO MIEMBROS'!B173","v":0},{"$f":"+'NO MIEMBROS'!C173","v":0},{"$f":"+'NO MIEMBROS'!D173","v":"PROFESIÓN/OFICIO:"},{"$f":"IF('NO MIEMBROS'!E173>0,'NO MIEMBROS'!E173,\"INCOMPLETO RECHAZAR\")","v":"INCOMPLETO RECHAZAR"},681]
[{"$f":"+'NO MIEMBROS'!A194","v":"l NO MIEMBRO"},{"$f":"+'NO MIEMBROS'!B194","v":0},{"$f":"+'NO MIEMBROS'!C194","v":0},{"$f":"+'NO MIEMBROS'!D194","v":""},{"$f":"IF('NO MIEMBROS'!E194>0,'NO MIEMBROS'!E194,\"INCOMPLETO RECHAZAR\")","v":"INCOMPLETO RECHAZAR"},682]
[{"$f":"+'NO MIEMBROS'!A191","v":"l NO MIEMBRO"},{"$f":"+'NO MIEMBROS'!B191","v":0},{"$f":"+'NO MIEMBROS'!C191","v":0},{"$f":"+'NO MIEMBROS'!D191","v":"CEL/TEL :"},{"$f":"IF('NO MIEMBROS'!E191>0,'NO MIEMBROS'!E191,\"INCOMPLETO RECHAZAR\")","v":"INCOMPLETO RECHAZAR"},683]
[{"$f":"+'NO MIEMBROS'!A185","v":"l NO MIEMBRO"},{"$f":"+'NO MIEMBROS'!B185","v":0},{"$f":"+'NO MIEMBROS'!C185","v":0},{"$f":"+'NO MIEMBROS'!D185","v":"CUIT/CUIL –sin puntos ni barras-:"},{"$f":"IF('NO MIEMBROS'!E185>0,'NO MIEMBROS'!E185,\"INCOMPLETO RECHAZAR\")","v":"INCOMPLETO RECHAZAR"},684]
[{"$f":"+'NO MIEMBROS'!A196","v":"l NO MIEMBRO"},{"$f":"+'NO MIEMBROS'!B196","v":0},{"$f":"+'NO MIEMBROS'!C196","v":0},{"$f":"+'NO MIEMBROS'!D196","v":""},{"$f":"IF('NO MIEMBROS'!E196>0,'NO MIEMBROS'!E196,\"INCOMPLETO RECHAZAR\")","v":"INCOMPLETO RECHAZAR"},685]
[{"$f":"+'NO MIEMBROS'!A184","v":"l NO MIEMBRO"},{"$f":"+'NO MIEMBROS'!B184","v":0},{"$f":"+'NO MIEMBROS'!C184","v":0},{"$f":"+'NO MIEMBROS'!D184","v":"DOC. IDENTIDAD –sin puntos-:"},{"$f":"IF('NO MIEMBROS'!E184>0,'NO MIEMBROS'!E184,\"INCOMPLETO RECHAZAR\")","v":"INCOMPLETO RECHAZAR"},686]
[{"$f":"+'NO MIEMBROS'!A190","v":"l NO MIEMBRO"},{"$f":"+'NO MIEMBROS'!B190","v":0},{"$f":"+'NO MIEMBROS'!C190","v":0},{"$f":"+'NO MIEMBROS'!D190","v":"DOMICILIO REAL:"},{"$f":"IF('NO MIEMBROS'!E190>0,'NO MIEMBROS'!E190,\"INCOMPLETO RECHAZAR\")","v":"INCOMPLETO RECHAZAR"},687]
[{"$f":"+'NO MIEMBROS'!A193","v":"l NO MIEMBRO"},{"$f":"+'NO MIEMBROS'!B193","v":0},{"$f":"+'NO MIEMBROS'!C193","v":0},{"$f":"+'NO MIEMBROS'!D193","v":"ESTADO CIVIL:"},{"$f":"IF('NO MIEMBROS'!E193>0,'NO MIEMBROS'!E193,\"INCOMPLETO RECHAZAR\")","v":"INCOMPLETO RECHAZAR"},688]
[{"$f":"+'NO MIEMBROS'!A186","v":"l NO MIEMBRO"},{"$f":"+'NO MIEMBROS'!B186","v":0},{"$f":"+'NO MIEMBROS'!C186","v":0},{"$f":"+'NO MIEMBROS'!D186","v":"FECHA DE NACIMIENTO –dd/mm/aa-:"},{"$f":"IF('NO MIEMBROS'!E186>0,'NO MIEMBROS'!E186,\"INCOMPLETO RECHAZAR\")","v":"INCOMPLETO RECHAZAR"},689]
[{"$f":"+'NO MIEMBROS'!A187","v":"l NO MIEMBRO"},{"$f":"+'NO MIEMBROS'!B187","v":0},{"$f":"+'NO MIEMBROS'!C187","v":0},{"$f":"+'NO MIEMBROS'!D187","v":"LUGAR DE NACIMIENTO:"},{"$f":"IF('NO MIEMBROS'!E187>0,'NO MIEMBROS'!E187,\"INCOMPLETO RECHAZAR\")","v":"INCOMPLETO RECHAZAR"},690]
[{"$f":"+'NO MIEMBROS'!A188","v":"l NO MIEMBRO"},{"$f":"+'NO MIEMBROS'!B188","v":0},{"$f":"+'NO MIEMBROS'!C188","v":0},{"$f":"+'NO MIEMBROS'!D188","v":"NACIONALIDAD:"},{"$f":"IF('NO MIEMBROS'!E188>0,'NO MIEMBROS'!E188,\"INCOMPLETO RECHAZAR\")","v":"INCOMPLETO RECHAZAR"},691]
[{"$f":"+'NO MIEMBROS'!A195","v":"l NO MIEMBRO"},{"$f":"+'NO MIEMBROS'!B195","v":0},{"$f":"+'NO MIEMBROS'!C195","v":0},{"$f":"+'NO MIEMBROS'!D195","v":""},{"$f":"IF('NO MIEMBROS'!E195>0,'NO MIEMBROS'!E195,\"INCOMPLETO RECHAZAR\")","v":"INCOMPLETO RECHAZAR"},692]
[{"$f":"+'NO MIEMBROS'!A199","v":"l NO MIEMBRO"},{"$f":"+'NO MIEMBROS'!B199","v":0},{"$f":"+'NO MIEMBROS'!C199","v":0},{"$f":"+'NO MIEMBROS'!D199","v":"NOTA/OBSERVACIÓN -en mayúscula-:"},{"$f":"IF('NO MIEMBROS'!E199>0,'NO MIEMBROS'!E199,\"INCOMPLETO RECHAZAR\")","v":"INCOMPLETO RECHAZAR"},693]
[{"$f":"+'NO MIEMBROS'!A189","v":"l NO MIEMBRO"},{"$f":"+'NO MIEMBROS'!B189","v":0},{"$f":"+'NO MIEMBROS'!C189","v":0},{"$f":"+'NO MIEMBROS'!D189","v":"PROFESIÓN/OFICIO:"},{"$f":"IF('NO MIEMBROS'!E189>0,'NO MIEMBROS'!E189,\"INCOMPLETO RECHAZAR\")","v":"INCOMPLETO RECHAZAR"},694]
[{"$f":"+'NO MIEMBROS'!A210","v":"l NO MIEMBRO"},{"$f":"+'NO MIEMBROS'!B210","v":0},{"$f":"+'NO MIEMBROS'!C210","v":0},{"$f":"+'NO MIEMBROS'!D210","v":""},{"$f":"IF('NO MIEMBROS'!E210>0,'NO MIEMBROS'!E210,\"INCOMPLETO RECHAZAR\")","v":"INCOMPLETO RECHAZAR"},695]
[{"$f":"+'NO MIEMBROS'!A207","v":"l NO MIEMBRO"},{"$f":"+'NO MIEMBROS'!B207","v":0},{"$f":"+'NO MIEMBROS'!C207","v":0},{"$f":"+'NO MIEMBROS'!D207","v":"CEL/TEL :"},{"$f":"IF('NO MIEMBROS'!E207>0,'NO MIEMBROS'!E207,\"INCOMPLETO RECHAZAR\")","v":"INCOMPLETO RECHAZAR"},696]
[{"$f":"+'NO MIEMBROS'!A201","v":"l NO MIEMBRO"},{"$f":"+'NO MIEMBROS'!B201","v":0},{"$f":"+'NO MIEMBROS'!C201","v":0},{"$f":"+'NO MIEMBROS'!D201","v":"CUIT/CUIL –sin puntos ni barras-:"},{"$f":"IF('NO MIEMBROS'!E201>0,'NO MIEMBROS'!E201,\"INCOMPLETO RECHAZAR\")","v":"INCOMPLETO RECHAZAR"},697]
[{"$f":"+'NO MIEMBROS'!A212","v":"l NO MIEMBRO"},{"$f":"+'NO MIEMBROS'!B212","v":0},{"$f":"+'NO MIEMBROS'!C212","v":0},{"$f":"+'NO MIEMBROS'!D212","v":""},{"$f":"IF('NO MIEMBROS'!E212>0,'NO MIEMBROS'!E212,\"INCOMPLETO RECHAZAR\")","v":"INCOMPLETO RECHAZAR"},698]
[{"$f":"+'NO MIEMBROS'!A200","v":"l NO MIEMBRO"},{"$f":"+'NO MIEMBROS'!B200","v":0},{"$f":"+'NO MIEMBROS'!C200","v":0},{"$f":"+'NO MIEMBROS'!D200","v":"DOC. IDENTIDAD –sin puntos-:"},{"$f":"IF('NO MIEMBROS'!E200>0,'NO MIEMBROS'!E200,\"INCOMPLETO RECHAZAR\")","v":"INCOMPLETO RECHAZAR"},699]
[{"$f":"+'NO MIEMBROS'!A206","v":"l NO MIEMBRO"},{"$f":"+'NO MIEMBROS'!B206","v":0},{"$f":"+'NO MIEMBROS'!C206","v":0},{"$f":"+'NO MIEMBROS'!D206","v":"DOMICILIO REAL:"},{"$f":"IF('NO MIEMBROS'!E206>0,'NO MIEMBROS'!E206,\"INCOMPLETO RECHAZAR\")","v":"INCOMPLETO RECHAZAR"},700]
[{"$f":"+'NO MIEMBROS'!A209","v":"l NO MIEMBRO"},{"$f":"+'NO MIEMBROS'!B209","v":0},{"$f":"+'NO MIEMBROS'!C209","v":0},{"$f":"+'NO MIEMBROS'!D209","v":"ESTADO CIVIL:"},{"$f":"IF('NO MIEMBROS'!E209>0,'NO MIEMBROS'!E209,\"INCOMPLETO RECHAZAR\")","v":"INCOMPLETO RECHAZAR"},701]
[{"$f":"+'NO MIEMBROS'!A202","v":"l NO MIEMBRO"},{"$f":"+'NO MIEMBROS'!B202","v":0},{"$f":"+'NO MIEMBROS'!C202","v":0},{"$f":"+'NO MIEMBROS'!D202","v":"FECHA DE NACIMIENTO –dd/mm/aa-:"},{"$f":"IF('NO MIEMBROS'!E202>0,'NO MIEMBROS'!E202,\"INCOMPLETO RECHAZAR\")","v":"INCOMPLETO RECHAZAR"},702]
[{"$f":"+'NO MIEMBROS'!A203","v":"l NO MIEMBRO"},{"$f":"+'NO MIEMBROS'!B203","v":0},{"$f":"+'NO MIEMBROS'!C203","v":0},{"$f":"+'NO MIEMBROS'!D203","v":"LUGAR DE NACIMIENTO:"},{"$f":"IF('NO MIEMBROS'!E203>0,'NO MIEMBROS'!E203,\"INCOMPLETO RECHAZAR\")","v":"INCOMPLETO RECHAZAR"},703]
[{"$f":"+'NO MIEMBROS'!A204","v":"l NO MIEMBRO"},{"$f":"+'NO MIEMBROS'!B204","v":0},{"$f":"+'NO MIEMBROS'!C204","v":0},{"$f":"+'NO MIEMBROS'!D204","v":"NACIONALIDAD:"},{"$f":"IF('NO MIEMBROS'!E204>0,'NO MIEMBROS'!E204,\"INCOMPLETO RECHAZAR\")","v":"INCOMPLETO RECHAZAR"},704]
[{"$f":"+'NO MIEMBROS'!A211","v":"l NO MIEMBRO"},{"$f":"+'NO MIEMBROS'!B211","v":0},{"$f":"+'NO MIEMBROS'!C211","v":0},{"$f":"+'NO MIEMBROS'!D211","v":""},{"$f":"IF('NO MIEMBROS'!E211>0,'NO MIEMBROS'!E211,\"INCOMPLETO RECHAZAR\")","v":"INCOMPLETO RECHAZAR"},705]
[{"$f":"+'NO MIEMBROS'!A215","v":"l NO MIEMBRO"},{"$f":"+'NO MIEMBROS'!B215","v":0},{"$f":"+'NO MIEMBROS'!C215","v":0},{"$f":"+'NO MIEMBROS'!D215","v":"NOTA/OBSERVACIÓN -en mayúscula-:"},{"$f":"IF('NO MIEMBROS'!E215>0,'NO MIEMBROS'!E215,\"INCOMPLETO RECHAZAR\")","v":"INCOMPLETO RECHAZAR"},706]
[{"$f":"+'NO MIEMBROS'!A205","v":"l NO MIEMBRO"},{"$f":"+'NO MIEMBROS'!B205","v":0},{"$f":"+'NO MIEMBROS'!C205","v":0},{"$f":"+'NO MIEMBROS'!D205","v":"PROFESIÓN/OFICIO:"},{"$f":"IF('NO MIEMBROS'!E205>0,'NO MIEMBROS'!E205,\"INCOMPLETO RECHAZAR\")","v":"INCOMPLETO RECHAZAR"},707]
[{"$f":"+'NO MIEMBROS'!A226","v":"l NO MIEMBRO"},{"$f":"+'NO MIEMBROS'!B226","v":0},{"$f":"+'NO MIEMBROS'!C226","v":0},{"$f":"+'NO MIEMBROS'!D226","v":""},{"$f":"IF('NO MIEMBROS'!E226>0,'NO MIEMBROS'!E226,\"INCOMPLETO RECHAZAR\")","v":"INCOMPLETO RECHAZAR"},708]
[{"$f":"+'NO MIEMBROS'!A223","v":"l NO MIEMBRO"},{"$f":"+'NO MIEMBROS'!B223","v":0},{"$f":"+'NO MIEMBROS'!C223","v":0},{"$f":"+'NO MIEMBROS'!D223","v":"CEL/TEL :"},{"$f":"IF('NO MIEMBROS'!E223>0,'NO MIEMBROS'!E223,\"INCOMPLETO RECHAZAR\")","v":"INCOMPLETO RECHAZAR"},709]
[{"$f":"+'NO MIEMBROS'!A217","v":"l NO MIEMBRO"},{"$f":"+'NO MIEMBROS'!B217","v":0},{"$f":"+'NO MIEMBROS'!C217","v":0},{"$f":"+'NO MIEMBROS'!D217","v":"CUIT/CUIL –sin puntos ni barras-:"},{"$f":"IF('NO MIEMBROS'!E217>0,'NO MIEMBROS'!E217,\"INCOMPLETO RECHAZAR\")","v":"INCOMPLETO RECHAZAR"},710]
[{"$f":"+'NO MIEMBROS'!A228","v":"l NO MIEMBRO"},{"$f":"+'NO MIEMBROS'!B228","v":0},{"$f":"+'NO MIEMBROS'!C228","v":0},{"$f":"+'NO MIEMBROS'!D228","v":""},{"$f":"IF('NO MIEMBROS'!E228>0,'NO MIEMBROS'!E228,\"INCOMPLETO RECHAZAR\")","v":"INCOMPLETO RECHAZAR"},711]
[{"$f":"+'NO MIEMBROS'!A216","v":"l NO MIEMBRO"},{"$f":"+'NO MIEMBROS'!B216","v":0},{"$f":"+'NO MIEMBROS'!C216","v":0},{"$f":"+'NO MIEMBROS'!D216","v":"DOC. IDENTIDAD –sin puntos-:"},{"$f":"IF('NO MIEMBROS'!E216>0,'NO MIEMBROS'!E216,\"INCOMPLETO RECHAZAR\")","v":"INCOMPLETO RECHAZAR"},712]
[{"$f":"+'NO MIEMBROS'!A222","v":"l NO MIEMBRO"},{"$f":"+'NO MIEMBROS'!B222","v":0},{"$f":"+'NO MIEMBROS'!C222","v":0},{"$f":"+'NO MIEMBROS'!D222","v":"DOMICILIO REAL:"},{"$f":"IF('NO MIEMBROS'!E222>0,'NO MIEMBROS'!E222,\"INCOMPLETO RECHAZAR\")","v":"INCOMPLETO RECHAZAR"},713]
[{"$f":"+'NO MIEMBROS'!A225","v":"l NO MIEMBRO"},{"$f":"+'NO MIEMBROS'!B225","v":0},{"$f":"+'NO MIEMBROS'!C225","v":0},{"$f":"+'NO MIEMBROS'!D225","v":"ESTADO CIVIL:"},{"$f":"IF('NO MIEMBROS'!E225>0,'NO MIEMBROS'!E225,\"INCOMPLETO RECHAZAR\")","v":"INCOMPLETO RECHAZAR"},714]
[{"$f":"+'NO MIEMBROS'!A218","v":"l NO MIEMBRO"},{"$f":"+'NO MIEMBROS'!B218","v":0},{"$f":"+'NO MIEMBROS'!C218","v":0},{"$f":"+'NO MIEMBROS'!D218","v":"FECHA DE NACIMIENTO –dd/mm/aa-:"},{"$f":"IF('NO MIEMBROS'!E218>0,'NO MIEMBROS'!E218,\"INCOMPLETO RECHAZAR\")","v":"INCOMPLETO RECHAZAR"},715]
[{"$f":"+'NO MIEMBROS'!A219","v":"l NO MIEMBRO"},{"$f":"+'NO MIEMBROS'!B219","v":0},{"$f":"+'NO MIEMBROS'!C219","v":0},{"$f":"+'NO MIEMBROS'!D219","v":"LUGAR DE NACIMIENTO:"},{"$f":"IF('NO MIEMBROS'!E219>0,'NO MIEMBROS'!E219,\"INCOMPLETO RECHAZAR\")","v":"INCOMPLETO RECHAZAR"},716]
[{"$f":"+'NO MIEMBROS'!A220","v":"l NO MIEMBRO"},{"$f":"+'NO MIEMBROS'!B220","v":0},{"$f":"+'NO MIEMBROS'!C220","v":0},{"$f":"+'NO MIEMBROS'!D220","v":"NACIONALIDAD:"},{"$f":"IF('NO MIEMBROS'!E220>0,'NO MIEMBROS'!E220,\"INCOMPLETO RECHAZAR\")","v":"INCOMPLETO RECHAZAR"},717]
[{"$f":"+'NO MIEMBROS'!A227","v":"l NO MIEMBRO"},{"$f":"+'NO MIEMBROS'!B227","v":0},{"$f":"+'NO MIEMBROS'!C227","v":0},{"$f":"+'NO MIEMBROS'!D227","v":""},{"$f":"IF('NO MIEMBROS'!E227>0,'NO MIEMBROS'!E227,\"INCOMPLETO RECHAZAR\")","v":"INCOMPLETO RECHAZAR"},718]
[{"$f":"+'NO MIEMBROS'!A231","v":"l NO MIEMBRO"},{"$f":"+'NO MIEMBROS'!B231","v":0},{"$f":"+'NO MIEMBROS'!C231","v":0},{"$f":"+'NO MIEMBROS'!D231","v":"NOTA/OBSERVACIÓN -en mayúscula-:"},{"$f":"IF('NO MIEMBROS'!E231>0,'NO MIEMBROS'!E231,\"INCOMPLETO RECHAZAR\")","v":"INCOMPLETO RECHAZAR"},719]
[{"$f":"+'NO MIEMBROS'!A221","v":"l NO MIEMBRO"},{"$f":"+'NO MIEMBROS'!B221","v":0},{"$f":"+'NO MIEMBROS'!C221","v":0},{"$f":"+'NO MIEMBROS'!D221","v":"PROFESIÓN/OFICIO:"},{"$f":"IF('NO MIEMBROS'!E221>0,'NO MIEMBROS'!E221,\"INCOMPLETO RECHAZAR\")","v":"INCOMPLETO RECHAZAR"},720]
[{"$f":"+'NO MIEMBROS'!A242","v":"l NO MIEMBRO"},{"$f":"+'NO MIEMBROS'!B242","v":0},{"$f":"+'NO MIEMBROS'!C242","v":0},{"$f":"+'NO MIEMBROS'!D242","v":""},{"$f":"IF('NO MIEMBROS'!E242>0,'NO MIEMBROS'!E242,\"INCOMPLETO RECHAZAR\")","v":"INCOMPLETO RECHAZAR"},721]
[{"$f":"+'NO MIEMBROS'!A239","v":"l NO MIEMBRO"},{"$f":"+'NO MIEMBROS'!B239","v":0},{"$f":"+'NO MIEMBROS'!C239","v":0},{"$f":"+'NO MIEMBROS'!D239","v":"CEL/TEL :"},{"$f":"IF('NO MIEMBROS'!E239>0,'NO MIEMBROS'!E239,\"INCOMPLETO RECHAZAR\")","v":"INCOMPLETO RECHAZAR"},722]
[{"$f":"+'NO MIEMBROS'!A233","v":"l NO MIEMBRO"},{"$f":"+'NO MIEMBROS'!B233","v":0},{"$f":"+'NO MIEMBROS'!C233","v":0},{"$f":"+'NO MIEMBROS'!D233","v":"CUIT/CUIL –sin puntos ni barras-:"},{"$f":"IF('NO MIEMBROS'!E233>0,'NO MIEMBROS'!E233,\"INCOMPLETO RECHAZAR\")","v":"INCOMPLETO RECHAZAR"},723]
[{"$f":"+'NO MIEMBROS'!A244","v":"l NO MIEMBRO"},{"$f":"+'NO MIEMBROS'!B244","v":0},{"$f":"+'NO MIEMBROS'!C244","v":0},{"$f":"+'NO MIEMBROS'!D244","v":""},{"$f":"IF('NO MIEMBROS'!E244>0,'NO MIEMBROS'!E244,\"INCOMPLETO RECHAZAR\")","v":"INCOMPLETO RECHAZAR"},724]
[{"$f":"+'NO MIEMBROS'!A232","v":"l NO MIEMBRO"},{"$f":"+'NO MIEMBROS'!B232","v":0},{"$f":"+'NO MIEMBROS'!C232","v":0},{"$f":"+'NO MIEMBROS'!D232","v":"DOC. IDENTIDAD –sin puntos-:"},{"$f":"IF('NO MIEMBROS'!E232>0,'NO MIEMBROS'!E232,\"INCOMPLETO RECHAZAR\")","v":"INCOMPLETO RECHAZAR"},725]
[{"$f":"+'NO MIEMBROS'!A238","v":"l NO MIEMBRO"},{"$f":"+'NO MIEMBROS'!B238","v":0},{"$f":"+'NO MIEMBROS'!C238","v":0},{"$f":"+'NO MIEMBROS'!D238","v":"DOMICILIO REAL:"},{"$f":"IF('NO MIEMBROS'!E238>0,'NO MIEMBROS'!E238,\"INCOMPLETO RECHAZAR\")","v":"INCOMPLETO RECHAZAR"},726]
[{"$f":"+'NO MIEMBROS'!A241","v":"l NO MIEMBRO"},{"$f":"+'NO MIEMBROS'!B241","v":0},{"$f":"+'NO MIEMBROS'!C241","v":0},{"$f":"+'NO MIEMBROS'!D241","v":"ESTADO CIVIL:"},{"$f":"IF('NO MIEMBROS'!E241>0,'NO MIEMBROS'!E241,\"INCOMPLETO RECHAZAR\")","v":"INCOMPLETO RECHAZAR"},727]
[{"$f":"+'NO MIEMBROS'!A234","v":"l NO MIEMBRO"},{"$f":"+'NO MIEMBROS'!B234","v":0},{"$f":"+'NO MIEMBROS'!C234","v":0},{"$f":"+'NO MIEMBROS'!D234","v":"FECHA DE NACIMIENTO –dd/mm/aa-:"},{"$f":"IF('NO MIEMBROS'!E234>0,'NO MIEMBROS'!E234,\"INCOMPLETO RECHAZAR\")","v":"INCOMPLETO RECHAZAR"},728]
[{"$f":"+'NO MIEMBROS'!A235","v":"l NO MIEMBRO"},{"$f":"+'NO MIEMBROS'!B235","v":0},{"$f":"+'NO MIEMBROS'!C235","v":0},{"$f":"+'NO MIEMBROS'!D235","v":"LUGAR DE NACIMIENTO:"},{"$f":"IF('NO MIEMBROS'!E235>0,'NO MIEMBROS'!E235,\"INCOMPLETO RECHAZAR\")","v":"INCOMPLETO RECHAZAR"},729]
[{"$f":"+'NO MIEMBROS'!A236","v":"l NO MIEMBRO"},{"$f":"+'NO MIEMBROS'!B236","v":0},{"$f":"+'NO MIEMBROS'!C236","v":0},{"$f":"+'NO MIEMBROS'!D236","v":"NACIONALIDAD:"},{"$f":"IF('NO MIEMBROS'!E236>0,'NO MIEMBROS'!E236,\"INCOMPLETO RECHAZAR\")","v":"INCOMPLETO RECHAZAR"},730]
[{"$f":"+'NO MIEMBROS'!A243","v":"l NO MIEMBRO"},{"$f":"+'NO MIEMBROS'!B243","v":0},{"$f":"+'NO MIEMBROS'!C243","v":0},{"$f":"+'NO MIEMBROS'!D243","v":""},{"$f":"IF('NO MIEMBROS'!E243>0,'NO MIEMBROS'!E243,\"INCOMPLETO RECHAZAR\")","v":"INCOMPLETO RECHAZAR"},731]
[{"$f":"+'NO MIEMBROS'!A247","v":"l NO MIEMBRO"},{"$f":"+'NO MIEMBROS'!B247","v":0},{"$f":"+'NO MIEMBROS'!C247","v":0},{"$f":"+'NO MIEMBROS'!D247","v":"NOTA/OBSERVACIÓN -en mayúscula-:"},{"$f":"IF('NO MIEMBROS'!E247>0,'NO MIEMBROS'!E247,\"INCOMPLETO RECHAZAR\")","v":"INCOMPLETO RECHAZAR"},732]
[{"$f":"+'NO MIEMBROS'!A237","v":"l NO MIEMBRO"},{"$f":"+'NO MIEMBROS'!B237","v":0},{"$f":"+'NO MIEMBROS'!C237","v":0},{"$f":"+'NO MIEMBROS'!D237","v":"PROFESIÓN/OFICIO:"},{"$f":"IF('NO MIEMBROS'!E237>0,'NO MIEMBROS'!E237,\"INCOMPLETO RECHAZAR\")","v":"INCOMPLETO RECHAZAR"},733]
[{"$f":"+'DATOS UT'!A34","v":"ba UNIÓN TRANSITORIA"},{"$f":"+'DATOS UT'!B34","v":0},{"$f":"+'DATOS UT'!C34","v":0},{"$f":"+'DATOS UT'!D34","v":"FECHA DE CELEBRACIÓN DEL CONTRATO:"},{"$f":"IF('DATOS UT'!E34>0,'NO MIEMBROS'!E238,\"INCOMPLETO RECHAZAR\")","v":"INCOMPLETO RECHAZAR"}]
[{"$f":"+'DATOS UT'!A35","v":"ba UNIÓN TRANSITORIA"},{"$f":"+'DATOS UT'!B35","v":0},{"$f":"+'DATOS UT'!C35","v":0},{"$f":"+'DATOS UT'!D35","v":"FECHA DE FINALIZACIÓN DEL CONTRATO:"},{"$f":"IF('DATOS UT'!E35>0,'NO MIEMBROS'!E239,\"INCOMPLETO RECHAZAR\")","v":"INCOMPLETO RECHAZAR"}]

{"sheet":"LISTADOS","index":5,"n_rows":74,"n_cols":7,"rows_kept":74,"cut":false,"hidden":true,"merged":[]}
["ESTADO CIVIL","ACTIVIDAD PRINCIPAL","ADMINISTRADOR SAS 1 socios","ADMINISTRADOR SAS 1 NO socios"]
["SOLTERO/A","COMERCIAL","SOCIO/A ADM. TITULAR","NO SOCIO/A ADM. TITULAR"]
["CASADO/A","INMOBILIARIA","SOCIO/A ADM. SUPLENTE","NO SOCIO/A ADM. SUPLENTE"]
["VIUDO/A","INDUSTRIAL"]
["DIVORCIADO/A","FINANCIERA",null,"SUMA ADM SUPLENTES SAS 1","SUMA ADM TITULAR SAS 1"]
[null,"TRANSPORTE",null,{"$f":"COUNTIFS(#REF!,\"*\"&\"SUPLENTE\"&\"*\")","v":{"$error":"#REF!"}},{"$f":"COUNTIFS(#REF!,\"*\"&\"TITULAR\"&\"*\")","v":{"$error":"#REF!"}}]
["GESTIONANTE","AGROPECUARIA",null,{"$f":"COUNTIFS(#REF!,\"*\"&\"SUPLENTE\"&\"*\")","v":{"$error":"#REF!"}},{"$f":"COUNTIFS(#REF!,\"*\"&\"TITULAR\"&\"*\")","v":{"$error":"#REF!"}}]
[null,"MINERA"]
["APODERADO/A LETRADO/A","EXTRACCIÓN PETROLEO Y/O GAS"]
["ESCRIBANO/A","CONSTRUCCIÓN"]
["AUTORIZADO/A","OTRA/S"]
["REP. LEGAL SOC."]
[]
["CUIT"]
["NO POSEE"]
["POSEE"]
["EN TRAMITE"]
[]
["ADMINISTRADOR","RESOLUCION 70/2011 -SOCIO",null,"PREGUNTAS","UIF SAS 1"]
[0,"SI",null,"SI","SI"]
["ADMINISTRADOR/A TITULAR","NO",null,"NO","NO"]
["ADMINISTRADOR/A SUPLENTE","ORG. FISCALIZACION"]
["PRESIDENTE/A",0,"ADMINISTRADOR NO SOCIO"]
["VICEPRESIDENTE/A","SINDICO/A",0]
["DIRECTOR/A","SINDICO/A SUPLENTE","ADMINISTRADOR/A TITULAR"]
["DIRECTOR/A SUPLENTE","AUDITOR/A","ADMINISTRADOR/A SUPLENTE"]
["SUBDIRECTOR/A","AUDITOR/A SUPLENTE","PRESIDENTE/A"]
["SUBDIRECTOR/A SUPLENTE","SUBAUDITOR/A","VICEPRESIDENTE/A"]
["SOCIO/A GERENTE","CONTRALOR/A","DIRECTOR/A"]
["SOCIO/A GERENTE SUPLENTE","CONTRALOR/A SUPLENTE","DIRECTOR/A SUPLENTE"]
["GERENTE/A","OTRO/A","SUBDIRECTOR/A"]
["GERENTE/A SUPLENTE",null,"SUBDIRECTOR/A SUPLENTE"]
["OTRO/A",null,"GERENTE/A"]
[null,null,"GERENTE/A SUPLENTE"]
[null,null,"OTRO/A"]
[]
[]
["CANTIDAD DE REP. LEGAL/ ADM TITULARES","CANTIDAD DE REP. LEGAL/ ADM SUPLENTES","CANTIDAD DE SOCIOS",null,null,"CANTIDAD DE NO SOCIOS"]
[{"$f":"+IF(MIEMBROS!$E31=\"ADMINISTRADOR/A TITULAR\",1,0)","v":0},{"$f":"+IF(MIEMBROS!$E31=\"ADMINISTRADOR/A SUPLENTE\",1,0)","v":0},{"$f":"IF(MIEMBROS!B16=0,0,1)","v":0},null,null,{"$f":"IF('NO MIEMBROS'!B8=0,0,1)","v":0}]
[{"$f":"+IF(MIEMBROS!$E53=\"ADMINISTRADOR/A TITULAR\",1,0)","v":0},{"$f":"+IF(MIEMBROS!$E53=\"ADMINISTRADOR/A SUPLENTE\",1,0)","v":0},{"$f":"IF(MIEMBROS!B34=0,0,1)","v":0},null,null,{"$f":"IF('NO MIEMBROS'!B24=0,0,1)","v":0}]
[{"$f":"+IF(MIEMBROS!$E75=\"ADMINISTRADOR/A TITULAR\",1,0)","v":0},{"$f":"+IF(MIEMBROS!$E75=\"ADMINISTRADOR/A SUPLENTE\",1,0)","v":0},{"$f":"IF(MIEMBROS!B56=0,0,1)","v":0},null,null,{"$f":"IF('NO MIEMBROS'!B40=0,0,1)","v":0}]
[{"$f":"+IF(MIEMBROS!$E97=\"ADMINISTRADOR/A TITULAR\",1,0)","v":0},{"$f":"+IF(MIEMBROS!$E97=\"ADMINISTRADOR/A SUPLENTE\",1,0)","v":0},{"$f":"IF(MIEMBROS!B78=0,0,1)","v":0},null,null,{"$f":"IF('NO MIEMBROS'!B56=0,0,1)","v":0}]
[{"$f":"+IF(MIEMBROS!$E119=\"ADMINISTRADOR/A TITULAR\",1,0)","v":0},{"$f":"+IF(MIEMBROS!$E119=\"ADMINISTRADOR/A SUPLENTE\",1,0)","v":0},{"$f":"IF(MIEMBROS!B100=0,0,1)","v":0},null,null,{"$f":"IF('NO MIEMBROS'!B72=0,0,1)","v":0}]
[{"$f":"+IF(MIEMBROS!$E141=\"ADMINISTRADOR/A TITULAR\",1,0)","v":0},{"$f":"+IF(MIEMBROS!$E141=\"ADMINISTRADOR/A SUPLENTE\",1,0)","v":0},{"$f":"IF(MIEMBROS!B122=0,0,1)","v":0},null,null,{"$f":"IF('NO MIEMBROS'!B88=0,0,1)","v":0}]
[{"$f":"+IF(MIEMBROS!$E163=\"ADMINISTRADOR/A TITULAR\",1,0)","v":0},{"$f":"+IF(MIEMBROS!$E163=\"ADMINISTRADOR/A SUPLENTE\",1,0)","v":0},{"$f":"IF(MIEMBROS!B144=0,0,1)","v":0},null,null,{"$f":"IF('NO MIEMBROS'!B104=0,0,1)","v":0}]
[{"$f":"+IF(MIEMBROS!$E185=\"ADMINISTRADOR/A TITULAR\",1,0)","v":0},{"$f":"+IF(MIEMBROS!$E185=\"ADMINISTRADOR/A SUPLENTE\",1,0)","v":0},{"$f":"IF(MIEMBROS!B166=0,0,1)","v":0},null,null,{"$f":"IF('NO MIEMBROS'!B120=0,0,1)","v":0}]
[{"$f":"+IF(MIEMBROS!$E207=\"ADMINISTRADOR/A TITULAR\",1,0)","v":0},{"$f":"+IF(MIEMBROS!$E207=\"ADMINISTRADOR/A SUPLENTE\",1,0)","v":0},{"$f":"IF(MIEMBROS!B188=0,0,1)","v":0},null,null,{"$f":"IF('NO MIEMBROS'!B136=0,0,1)","v":0}]
[{"$f":"+IF(MIEMBROS!$E229=\"ADMINISTRADOR/A TITULAR\",1,0)","v":0},{"$f":"+IF(MIEMBROS!$E229=\"ADMINISTRADOR/A SUPLENTE\",1,0)","v":0},{"$f":"IF(MIEMBROS!B210=0,0,1)","v":0},null,null,{"$f":"IF('NO MIEMBROS'!B152=0,0,1)","v":0}]
[{"$f":"+IF(MIEMBROS!$E251=\"ADMINISTRADOR/A TITULAR\",1,0)","v":0},{"$f":"+IF(MIEMBROS!$E251=\"ADMINISTRADOR/A SUPLENTE\",1,0)","v":0},{"$f":"IF(MIEMBROS!B232=0,0,1)","v":0},null,null,{"$f":"IF('NO MIEMBROS'!B168=0,0,1)","v":0}]
[{"$f":"+IF(MIEMBROS!#REF!=\"ADMINISTRADOR/A TITULAR\",1,0)","v":{"$error":"#REF!"}},{"$f":"+IF(MIEMBROS!#REF!=\"ADMINISTRADOR/A SUPLENTE\",1,0)","v":{"$error":"#REF!"}},{"$f":"IF(MIEMBROS!B254=0,0,1)","v":0},null,null,{"$f":"IF('NO MIEMBROS'!B184=0,0,1)","v":0}]
[{"$f":"+IF(MIEMBROS!#REF!=\"ADMINISTRADOR/A TITULAR\",1,0)","v":{"$error":"#REF!"}},{"$f":"+IF(MIEMBROS!#REF!=\"ADMINISTRADOR/A SUPLENTE\",1,0)","v":{"$error":"#REF!"}},{"$f":"IF(MIEMBROS!#REF!=0,0,1)","v":{"$error":"#REF!"}},null,null,{"$f":"IF('NO MIEMBROS'!B200=0,0,1)","v":0}]
[{"$f":"+IF(MIEMBROS!#REF!=\"ADMINISTRADOR/A TITULAR\",1,0)","v":{"$error":"#REF!"}},{"$f":"+IF(MIEMBROS!#REF!=\"ADMINISTRADOR/A SUPLENTE\",1,0)","v":{"$error":"#REF!"}},{"$f":"IF(MIEMBROS!#REF!=0,0,1)","v":{"$error":"#REF!"}},{"$f":"+SUM(C39:C52)","v":{"$error":"#REF!"}},"TOTAL SOCIOS PH",{"$f":"IF('NO MIEMBROS'!B216=0,0,1)","v":0}]
[{"$f":"+IF('NO MIEMBROS'!$E21=\"ADMINISTRADOR/A TITULAR\",1,0)","v":0},{"$f":"+IF('NO MIEMBROS'!$E21=\"ADMINISTRADOR/A SUPLENTE\",1,0)","v":0},{"$f":"IF(MIEMBROS!H16=0,0,1)","v":0},null,null,{"$f":"IF('NO MIEMBROS'!B232=0,0,1)","v":0}]
[{"$f":"+IF('NO MIEMBROS'!$E22=\"ADMINISTRADOR/A TITULAR\",1,0)","v":0},{"$f":"+IF('NO MIEMBROS'!$E22=\"ADMINISTRADOR/A SUPLENTE\",1,0)","v":0},{"$f":"IF(MIEMBROS!H29=0,0,1)","v":0},null,{"$f":"MIEMBROS!#REF!+MIEMBROS!E51+MIEMBROS!E73+MIEMBROS!E95+MIEMBROS!E117+MIEMBROS!E139+MIEMBROS!E161+MIEMBROS!E183+MIEMBROS!E205+MIEMBROS!E227+MIEMBROS!E249+MIEMBROS!#REF!+MIEMBROS!#REF!+MIEMBROS!#REF!+MIEMBROS!#REF!+MIEMBROS!J43+MIEMBROS!J60+MIEMBROS!J77+MIEMBROS!J94+MIEMBROS!J111+MIEMBROS!J128+MIEMBROS!J145+MIEMBROS!#REF!+MIEMBROS!#REF!","v":{"$error":"#REF!"}},{"$f":"SUM(F39:F53)","v":0},"TOTAL NO SOCIOS"]
[{"$f":"+IF('NO MIEMBROS'!$E53=\"ADMINISTRADOR/A TITULAR\",1,0)","v":0},{"$f":"+IF('NO MIEMBROS'!$E53=\"ADMINISTRADOR/A SUPLENTE\",1,0)","v":0},{"$f":"IF(MIEMBROS!H46=0,0,1)","v":0}]
[{"$f":"+IF('NO MIEMBROS'!$E69=\"ADMINISTRADOR/A TITULAR\",1,0)","v":0},{"$f":"+IF('NO MIEMBROS'!$E69=\"ADMINISTRADOR/A SUPLENTE\",1,0)","v":0},{"$f":"IF(MIEMBROS!H63=0,0,1)","v":0}]
[{"$f":"+IF('NO MIEMBROS'!E85=\"ADMINISTRADOR/A TITULAR\",1,0)","v":0},{"$f":"+IF('NO MIEMBROS'!F85=\"ADMINISTRADOR/A SUPLENTE\",1,0)","v":0},{"$f":"IF(MIEMBROS!H80=0,0,1)","v":0}]
[{"$f":"+IF('NO MIEMBROS'!E101=\"ADMINISTRADOR/A TITULAR\",1,0)","v":0},{"$f":"+IF('NO MIEMBROS'!F101=\"ADMINISTRADOR/A SUPLENTE\",1,0)","v":0},{"$f":"IF(MIEMBROS!H97=0,0,1)","v":0}]
[{"$f":"+IF('NO MIEMBROS'!E117=\"ADMINISTRADOR/A TITULAR\",1,0)","v":0},{"$f":"+IF('NO MIEMBROS'!F117=\"ADMINISTRADOR/A SUPLENTE\",1,0)","v":0},{"$f":"IF(MIEMBROS!H114=0,0,1)","v":0}]
[{"$f":"+IF('NO MIEMBROS'!E133=\"ADMINISTRADOR/A TITULAR\",1,0)","v":0},{"$f":"+IF('NO MIEMBROS'!F133=\"ADMINISTRADOR/A SUPLENTE\",1,0)","v":0},{"$f":"IF(MIEMBROS!H131=0,0,1)","v":0}]
[{"$f":"+IF('NO MIEMBROS'!E149=\"ADMINISTRADOR/A TITULAR\",1,0)","v":0},{"$f":"+IF('NO MIEMBROS'!F149=\"ADMINISTRADOR/A SUPLENTE\",1,0)","v":0},{"$f":"IF(MIEMBROS!#REF!=0,0,1)","v":{"$error":"#REF!"}}]
[{"$f":"+IF('NO MIEMBROS'!E165=\"ADMINISTRADOR/A TITULAR\",1,0)","v":0},{"$f":"+IF('NO MIEMBROS'!F165=\"ADMINISTRADOR/A SUPLENTE\",1,0)","v":0},{"$f":"IF(MIEMBROS!#REF!=0,0,1)","v":{"$error":"#REF!"}},{"$f":"+SUM(C53:C62)","v":{"$error":"#REF!"}},"TOTAL SOCIOS PJ"]
[{"$f":"+IF('NO MIEMBROS'!E181=\"ADMINISTRADOR/A TITULAR\",1,0)","v":0},{"$f":"+IF('NO MIEMBROS'!F181=\"ADMINISTRADOR/A SUPLENTE\",1,0)","v":0},{"$f":"SUM(C39:C62)","v":{"$error":"#REF!"}},"TOTAL SOCIOS"]
[{"$f":"+IF('NO MIEMBROS'!E197=\"ADMINISTRADOR/A TITULAR\",1,0)","v":0},{"$f":"+IF('NO MIEMBROS'!F197=\"ADMINISTRADOR/A SUPLENTE\",1,0)","v":0}]
[{"$f":"+IF('NO MIEMBROS'!E213=\"ADMINISTRADOR/A TITULAR\",1,0)","v":0},{"$f":"+IF('NO MIEMBROS'!F213=\"ADMINISTRADOR/A SUPLENTE\",1,0)","v":0}]
[{"$f":"+IF('NO MIEMBROS'!E229=\"ADMINISTRADOR/A TITULAR\",1,0)","v":0},{"$f":"+IF('NO MIEMBROS'!F229=\"ADMINISTRADOR/A SUPLENTE\",1,0)","v":0}]
[{"$f":"+IF('NO MIEMBROS'!E245=\"ADMINISTRADOR/A TITULAR\",1,0)","v":0},{"$f":"+IF('NO MIEMBROS'!F245=\"ADMINISTRADOR/A SUPLENTE\",1,0)","v":0}]
[{"$f":"SUM(A39:A67)","v":{"$error":"#REF!"}},{"$f":"SUM(B39:B67)","v":{"$error":"#REF!"}},"TOTALES"]
[]
[]
["TRAMITES"]
["ELEGIR"]
["INSCRIPCIÓN INICIAL"]
["MODIFICACION/ES"]

{"sheet":"BD-GRAL","index":6,"n_rows":642,"n_cols":18,"rows_kept":642,"cut":false,"hidden":true,"merged":[[4,0,5,0],[4,1,5,1],[4,2,4,3],[4,4,5,4],[4,5,5,5],[1,7,1,8],[2,7,2,8],[3,4,3,5],[3,7,3,8],[4,13,4,17],[4,6,4,7],[4,8,5,8],[4,9,5,9],[4,10,5,10],[4,11,5,11],[4,12,5,12]]}
["BASE DE DATOS"]
["FECHA DE CARGA BASE DATOS:",null,null,null,null,null,null,{"$f":"+IF(G2>0,\".\",\"ERROR llene FECHA\")","v":"ERROR llene FECHA"}]
["EXPTE. NRO. DONDE SE DENUNCIÓ DATOS:",null,null,null,null,null,null,{"$f":"+IF(G3>0,\".\",\"ERROR llene NRO. EXPTE.\")","v":"ERROR llene NRO. EXPTE."}]
[null,null,null,null,"NRO. DE LEGAJO",null,null,{"$f":"+IF(G4>0,\".\",\"ERROR llene NRO. LEGAJO\")","v":"ERROR llene NRO. LEGAJO"}]
["COD. Int.","FORM.","DATOS DENUNCIADOS",null,"VINCULADOS","VINCULADOS","DATOS",null,"FECHA","NRO. DE LEGAJO","EXPTE./OTROS","FS.","NOTA/ OTROS","OBSERVACION"]
[null,null,"INSCRIPTO RPC","FECHA ALTA/MO-DIFICACIÓN",null,null,"CONCEPTO","COMPLETAR -EN MAYUSCULA -",null,null,null,null,null,"FECHA","DETALLE","EXPTE./ OTRO/s","FS.","NOTA/ OTROS"]
[]
[null,{"$f":"IF(E8=0,0,IMPRIMIR!A7)","v":0},{"$f":"IF(E8=0,0,IMPRIMIR!$D$3)","v":0},{"$f":"IF(E8=\"0\",0,$G$2)","v":0},{"$f":"IMPRIMIR!B7","v":0},{"$f":"IMPRIMIR!C7","v":0},{"$f":"IF(E8=0,0,IMPRIMIR!D7)","v":0},{"$f":"IF(E8=0,0,IMPRIMIR!E7)","v":0},{"$f":"IF(E8=0,0,$G$2)","v":0},{"$f":"IF(E8=0,0,$G$4)","v":0},{"$f":"IF(E8=0,0,$G$3)","v":0}]
[null,{"$f":"IF(E9=0,0,IMPRIMIR!A8)","v":0},{"$f":"IF(E9=0,0,IMPRIMIR!$D$3)","v":0},{"$f":"IF(E9=\"0\",0,$G$2)","v":0},{"$f":"IMPRIMIR!B8","v":0},{"$f":"IMPRIMIR!C8","v":0},{"$f":"IF(E9=0,0,IMPRIMIR!D8)","v":0},{"$f":"IF(E9=0,0,IMPRIMIR!E8)","v":0},{"$f":"IF(E9=0,0,$G$2)","v":0},{"$f":"IF(E9=0,0,$G$4)","v":0},{"$f":"IF(E9=0,0,$G$3)","v":0}]
[null,{"$f":"IF(E10=0,0,IMPRIMIR!A9)","v":0},{"$f":"IF(E10=0,0,IMPRIMIR!$D$3)","v":0},0,{"$f":"IMPRIMIR!B9","v":0},{"$f":"IMPRIMIR!C9","v":0},{"$f":"IF(E10=0,0,IMPRIMIR!D9)","v":0},{"$f":"IF(E10=0,0,IMPRIMIR!E9)","v":0},0,0,0]
[null,{"$f":"IF(E11=0,0,IMPRIMIR!A10)","v":0},{"$f":"IF(E11=0,0,IMPRIMIR!$D$3)","v":0},0,{"$f":"IMPRIMIR!B10","v":0},{"$f":"IMPRIMIR!C10","v":0},{"$f":"IF(E11=0,0,IMPRIMIR!D10)","v":0},{"$f":"IF(E11=0,0,IMPRIMIR!E10)","v":0},0,0,0]
[null,{"$f":"IF(E12=0,0,IMPRIMIR!A11)","v":0},{"$f":"IF(E12=0,0,IMPRIMIR!$D$3)","v":0},0,{"$f":"IMPRIMIR!B11","v":0},{"$f":"IMPRIMIR!C11","v":0},{"$f":"IF(E12=0,0,IMPRIMIR!D11)","v":0},{"$f":"IF(E12=0,0,IMPRIMIR!E11)","v":0},0,0,0]
[null,{"$f":"IF(E13=0,0,IMPRIMIR!A12)","v":0},{"$f":"IF(E13=0,0,IMPRIMIR!$D$3)","v":0},0,{"$f":"IMPRIMIR!B12","v":0},{"$f":"IMPRIMIR!C12","v":0},{"$f":"IF(E13=0,0,IMPRIMIR!D12)","v":0},{"$f":"IF(E13=0,0,IMPRIMIR!E12)","v":0},0,0,0]
[null,{"$f":"IF(E14=0,0,IMPRIMIR!A13)","v":0},{"$f":"IF(E14=0,0,IMPRIMIR!$D$3)","v":0},0,{"$f":"IMPRIMIR!B13","v":0},{"$f":"IMPRIMIR!C13","v":0},{"$f":"IF(E14=0,0,IMPRIMIR!D13)","v":0},{"$f":"IF(E14=0,0,IMPRIMIR!E13)","v":0},0,0,0]
[null,{"$f":"IF(E15=0,0,IMPRIMIR!A14)","v":0},{"$f":"IF(E15=0,0,IMPRIMIR!$D$3)","v":0},0,{"$f":"IMPRIMIR!B14","v":0},{"$f":"IMPRIMIR!C14","v":0},{"$f":"IF(E15=0,0,IMPRIMIR!D14)","v":0},{"$f":"IF(E15=0,0,IMPRIMIR!E14)","v":0},0,0,0]
[null,{"$f":"IF(E16=0,0,IMPRIMIR!A15)","v":"ba UNIÓN TRANSITORIA"},{"$f":"IF(E16=0,0,IMPRIMIR!$D$3)","v":0},0,{"$f":"IMPRIMIR!B15","v":"0"},{"$f":"IMPRIMIR!C15","v":"0"},{"$f":"IF(E16=0,0,IMPRIMIR!D15)","v":"CEL/TEL (de administración) -en su caso indicar que no posee-:"},{"$f":"IF(E16=0,0,IMPRIMIR!E15)","v":"INCOMPLETO RECHAZAR"},0,0,0]
[null,{"$f":"IF(E17=0,0,IMPRIMIR!A16)","v":"ba UNIÓN TRANSITORIA"},{"$f":"IF(E17=0,0,IMPRIMIR!$D$3)","v":0},0,{"$f":"IMPRIMIR!B16","v":"0"},{"$f":"IMPRIMIR!C16","v":"0"},{"$f":"IF(E17=0,0,IMPRIMIR!D16)","v":"EMAIL (de administración)  -en su caso indicar que no posee-:"},{"$f":"IF(E17=0,0,IMPRIMIR!E16)","v":"INCOMPLETO RECHAZAR"},0,0,0]
[null,{"$f":"IF(E18=0,0,IMPRIMIR!A17)","v":"ba UNIÓN TRANSITORIA"},{"$f":"IF(E18=0,0,IMPRIMIR!$D$3)","v":0},0,{"$f":"IMPRIMIR!B17","v":"0"},{"$f":"IMPRIMIR!C17","v":"0"},{"$f":"IF(E18=0,0,IMPRIMIR!D17)","v":"DIRECCION domicilio legal:"},{"$f":"IF(E18=0,0,IMPRIMIR!E17)","v":"INCOMPLETO RECHAZAR"},0,0,0]
[null,{"$f":"IF(E19=0,0,IMPRIMIR!A18)","v":"ba UNIÓN TRANSITORIA"},{"$f":"IF(E19=0,0,IMPRIMIR!$D$3)","v":0},0,{"$f":"IMPRIMIR!B18","v":"0"},{"$f":"IMPRIMIR!C18","v":"0"},{"$f":"IF(E19=0,0,IMPRIMIR!D18)","v":"CUIT –sin puntos ni barras-:"},{"$f":"IF(E19=0,0,IMPRIMIR!E18)","v":"INCOMPLETO RECHAZAR"},0,0,0]
[null,{"$f":"IF(E20=0,0,IMPRIMIR!A19)","v":0},{"$f":"IF(E20=0,0,IMPRIMIR!$D$3)","v":0},0,{"$f":"IMPRIMIR!B19","v":0},{"$f":"IMPRIMIR!C19","v":0},{"$f":"IF(E20=0,0,IMPRIMIR!D19)","v":0},{"$f":"IF(E20=0,0,IMPRIMIR!E19)","v":0},0,0,0]
[null,{"$f":"IF(E21=0,0,IMPRIMIR!A20)","v":0},{"$f":"IF(E21=0,0,IMPRIMIR!$D$3)","v":0},0,{"$f":"IMPRIMIR!B20","v":0},{"$f":"IMPRIMIR!C20","v":0},{"$f":"IF(E21=0,0,IMPRIMIR!D20)","v":0},{"$f":"IF(E21=0,0,IMPRIMIR!E20)","v":0},0,0,0]
[null,{"$f":"IF(E22=0,0,IMPRIMIR!A21)","v":0},{"$f":"IF(E22=0,0,IMPRIMIR!$D$3)","v":0},0,{"$f":"IMPRIMIR!B21","v":0},{"$f":"IMPRIMIR!C21","v":0},{"$f":"IF(E22=0,0,IMPRIMIR!D21)","v":0},{"$f":"IF(E22=0,0,IMPRIMIR!E21)","v":0},0,0,0]
[null,{"$f":"IF(E23=0,0,IMPRIMIR!A22)","v":0},{"$f":"IF(E23=0,0,IMPRIMIR!$D$3)","v":0},0,{"$f":"IMPRIMIR!B22","v":0},{"$f":"IMPRIMIR!C22","v":0},{"$f":"IF(E23=0,0,IMPRIMIR!D22)","v":0},{"$f":"IF(E23=0,0,IMPRIMIR!E22)","v":0},0,0,0]
[null,{"$f":"IF(E24=0,0,IMPRIMIR!A23)","v":0},{"$f":"IF(E24=0,0,IMPRIMIR!$D$3)","v":0},0,{"$f":"IMPRIMIR!B23","v":0},{"$f":"IMPRIMIR!C23","v":0},{"$f":"IF(E24=0,0,IMPRIMIR!D23)","v":0},{"$f":"IF(E24=0,0,IMPRIMIR!E23)","v":0},0,0,0]
[null,{"$f":"IF(E25=0,0,IMPRIMIR!A24)","v":0},{"$f":"IF(E25=0,0,IMPRIMIR!$D$3)","v":0},0,{"$f":"IMPRIMIR!B24","v":0},{"$f":"IMPRIMIR!C24","v":0},{"$f":"IF(E25=0,0,IMPRIMIR!D24)","v":0},{"$f":"IF(E25=0,0,IMPRIMIR!E24)","v":0},0,0,0]
[null,{"$f":"IF(E26=0,0,IMPRIMIR!A25)","v":0},{"$f":"IF(E26=0,0,IMPRIMIR!$D$3)","v":0},0,{"$f":"IMPRIMIR!B25","v":0},{"$f":"IMPRIMIR!C25","v":0},{"$f":"IF(E26=0,0,IMPRIMIR!D25)","v":0},{"$f":"IF(E26=0,0,IMPRIMIR!E25)","v":0},0,0,0]
[null,{"$f":"IF(E27=0,0,IMPRIMIR!A26)","v":0},{"$f":"IF(E27=0,0,IMPRIMIR!$D$3)","v":0},0,{"$f":"IMPRIMIR!B26","v":0},{"$f":"IMPRIMIR!C26","v":0},{"$f":"IF(E27=0,0,IMPRIMIR!D26)","v":0},{"$f":"IF(E27=0,0,IMPRIMIR!E26)","v":0},0,0,0]
[null,{"$f":"IF(E28=0,0,IMPRIMIR!A27)","v":0},{"$f":"IF(E28=0,0,IMPRIMIR!$D$3)","v":0},0,{"$f":"IMPRIMIR!B27","v":0},{"$f":"IMPRIMIR!C27","v":0},{"$f":"IF(E28=0,0,IMPRIMIR!D27)","v":0},{"$f":"IF(E28=0,0,IMPRIMIR!E27)","v":0},0,0,0]
[null,{"$f":"IF(E29=0,0,IMPRIMIR!A28)","v":0},{"$f":"IF(E29=0,0,IMPRIMIR!$D$3)","v":0},0,{"$f":"IMPRIMIR!B28","v":0},{"$f":"IMPRIMIR!C28","v":0},{"$f":"IF(E29=0,0,IMPRIMIR!D28)","v":0},{"$f":"IF(E29=0,0,IMPRIMIR!E28)","v":0},0,0,0]
[null,{"$f":"IF(E30=0,0,IMPRIMIR!A29)","v":0},{"$f":"IF(E30=0,0,IMPRIMIR!$D$3)","v":0},0,{"$f":"IMPRIMIR!B29","v":0},{"$f":"IMPRIMIR!C29","v":0},{"$f":"IF(E30=0,0,IMPRIMIR!D29)","v":0},{"$f":"IF(E30=0,0,IMPRIMIR!E29)","v":0},0,0,0]
[null,{"$f":"IF(E31=0,0,IMPRIMIR!A30)","v":0},{"$f":"IF(E31=0,0,IMPRIMIR!$D$3)","v":0},0,{"$f":"IMPRIMIR!B30","v":0},{"$f":"IMPRIMIR!C30","v":0},{"$f":"IF(E31=0,0,IMPRIMIR!D30)","v":0},{"$f":"IF(E31=0,0,IMPRIMIR!E30)","v":0},0,0,0]
[null,{"$f":"IF(E32=0,0,IMPRIMIR!A31)","v":0},{"$f":"IF(E32=0,0,IMPRIMIR!$D$3)","v":0},0,{"$f":"IMPRIMIR!B31","v":0},{"$f":"IMPRIMIR!C31","v":0},{"$f":"IF(E32=0,0,IMPRIMIR!D31)","v":0},{"$f":"IF(E32=0,0,IMPRIMIR!E31)","v":0},0,0,0]
[null,{"$f":"IF(E33=0,0,IMPRIMIR!A32)","v":0},{"$f":"IF(E33=0,0,IMPRIMIR!$D$3)","v":0},0,{"$f":"IMPRIMIR!B32","v":0},{"$f":"IMPRIMIR!C32","v":0},{"$f":"IF(E33=0,0,IMPRIMIR!D32)","v":0},{"$f":"IF(E33=0,0,IMPRIMIR!E32)","v":0},0,0,0]
[null,{"$f":"IF(E34=0,0,IMPRIMIR!A33)","v":0},{"$f":"IF(E34=0,0,IMPRIMIR!$D$3)","v":0},0,{"$f":"IMPRIMIR!B33","v":0},{"$f":"IMPRIMIR!C33","v":0},{"$f":"IF(E34=0,0,IMPRIMIR!D33)","v":0},{"$f":"IF(E34=0,0,IMPRIMIR!E33)","v":0},0,0,0]
[null,{"$f":"IF(E35=0,0,IMPRIMIR!A34)","v":0},{"$f":"IF(E35=0,0,IMPRIMIR!$D$3)","v":0},0,{"$f":"IMPRIMIR!B34","v":0},{"$f":"IMPRIMIR!C34","v":0},{"$f":"IF(E35=0,0,IMPRIMIR!D34)","v":0},{"$f":"IF(E35=0,0,IMPRIMIR!E34)","v":0},0,0,0]
[null,{"$f":"IF(E36=0,0,IMPRIMIR!A35)","v":0},{"$f":"IF(E36=0,0,IMPRIMIR!$D$3)","v":0},0,{"$f":"IMPRIMIR!B35","v":0},{"$f":"IMPRIMIR!C35","v":0},{"$f":"IF(E36=0,0,IMPRIMIR!D35)","v":0},{"$f":"IF(E36=0,0,IMPRIMIR!E35)","v":0},0,0,0]
[null,{"$f":"IF(E37=0,0,IMPRIMIR!A36)","v":0},{"$f":"IF(E37=0,0,IMPRIMIR!$D$3)","v":0},0,{"$f":"IMPRIMIR!B36","v":0},{"$f":"IMPRIMIR!C36","v":0},{"$f":"IF(E37=0,0,IMPRIMIR!D36)","v":0},{"$f":"IF(E37=0,0,IMPRIMIR!E36)","v":0},0,0,0]
[null,{"$f":"IF(E38=0,0,IMPRIMIR!A37)","v":0},{"$f":"IF(E38=0,0,IMPRIMIR!$D$3)","v":0},0,{"$f":"IMPRIMIR!B37","v":0},{"$f":"IMPRIMIR!C37","v":0},{"$f":"IF(E38=0,0,IMPRIMIR!D37)","v":0},{"$f":"IF(E38=0,0,IMPRIMIR!E37)","v":0},0,0,0]
[null,{"$f":"IF(E39=0,0,IMPRIMIR!A38)","v":0},{"$f":"IF(E39=0,0,IMPRIMIR!$D$3)","v":0},0,{"$f":"IMPRIMIR!B38","v":0},{"$f":"IMPRIMIR!C38","v":0},{"$f":"IF(E39=0,0,IMPRIMIR!D38)","v":0},{"$f":"IF(E39=0,0,IMPRIMIR!E38)","v":0},0,0,0]
[null,{"$f":"IF(E40=0,0,IMPRIMIR!A39)","v":0},{"$f":"IF(E40=0,0,IMPRIMIR!$D$3)","v":0},0,{"$f":"IMPRIMIR!B39","v":0},{"$f":"IMPRIMIR!C39","v":0},{"$f":"IF(E40=0,0,IMPRIMIR!D39)","v":0},{"$f":"IF(E40=0,0,IMPRIMIR!E39)","v":0},0,0,0]
[null,{"$f":"IF(E41=0,0,IMPRIMIR!A40)","v":0},{"$f":"IF(E41=0,0,IMPRIMIR!$D$3)","v":0},0,{"$f":"IMPRIMIR!B40","v":0},{"$f":"IMPRIMIR!C40","v":0},{"$f":"IF(E41=0,0,IMPRIMIR!D40)","v":0},{"$f":"IF(E41=0,0,IMPRIMIR!E40)","v":0},0,0,0]
[null,{"$f":"IF(E42=0,0,IMPRIMIR!A41)","v":0},{"$f":"IF(E42=0,0,IMPRIMIR!$D$3)","v":0},0,{"$f":"IMPRIMIR!B41","v":0},{"$f":"IMPRIMIR!C41","v":0},{"$f":"IF(E42=0,0,IMPRIMIR!D41)","v":0},{"$f":"IF(E42=0,0,IMPRIMIR!E41)","v":0},0,0,0]
[null,{"$f":"IF(E43=0,0,IMPRIMIR!A42)","v":0},{"$f":"IF(E43=0,0,IMPRIMIR!$D$3)","v":0},0,{"$f":"IMPRIMIR!B42","v":0},{"$f":"IMPRIMIR!C42","v":0},{"$f":"IF(E43=0,0,IMPRIMIR!D42)","v":0},{"$f":"IF(E43=0,0,IMPRIMIR!E42)","v":0},0,0,0]
[null,{"$f":"IF(E44=0,0,IMPRIMIR!A43)","v":0},{"$f":"IF(E44=0,0,IMPRIMIR!$D$3)","v":0},0,{"$f":"IMPRIMIR!B43","v":0},{"$f":"IMPRIMIR!C43","v":0},{"$f":"IF(E44=0,0,IMPRIMIR!D43)","v":0},{"$f":"IF(E44=0,0,IMPRIMIR!E43)","v":0},0,0,0]
[null,{"$f":"IF(E45=0,0,IMPRIMIR!A44)","v":0},{"$f":"IF(E45=0,0,IMPRIMIR!$D$3)","v":0},0,{"$f":"IMPRIMIR!B44","v":0},{"$f":"IMPRIMIR!C44","v":0},{"$f":"IF(E45=0,0,IMPRIMIR!D44)","v":0},{"$f":"IF(E45=0,0,IMPRIMIR!E44)","v":0},0,0,0]
[null,{"$f":"IF(E46=0,0,IMPRIMIR!A45)","v":0},{"$f":"IF(E46=0,0,IMPRIMIR!$D$3)","v":0},0,{"$f":"IMPRIMIR!B45","v":0},{"$f":"IMPRIMIR!C45","v":0},{"$f":"IF(E46=0,0,IMPRIMIR!D45)","v":0},{"$f":"IF(E46=0,0,IMPRIMIR!E45)","v":0},0,0,0]
[null,{"$f":"IF(E47=0,0,IMPRIMIR!A46)","v":0},{"$f":"IF(E47=0,0,IMPRIMIR!$D$3)","v":0},0,{"$f":"IMPRIMIR!B46","v":0},{"$f":"IMPRIMIR!C46","v":0},{"$f":"IF(E47=0,0,IMPRIMIR!D46)","v":0},{"$f":"IF(E47=0,0,IMPRIMIR!E46)","v":0},0,0,0]
[null,{"$f":"IF(E48=0,0,IMPRIMIR!A47)","v":0},{"$f":"IF(E48=0,0,IMPRIMIR!$D$3)","v":0},0,{"$f":"IMPRIMIR!B47","v":0},{"$f":"IMPRIMIR!C47","v":0},{"$f":"IF(E48=0,0,IMPRIMIR!D47)","v":0},{"$f":"IF(E48=0,0,IMPRIMIR!E47)","v":0},0,0,0]
[null,{"$f":"IF(E49=0,0,IMPRIMIR!A48)","v":0},{"$f":"IF(E49=0,0,IMPRIMIR!$D$3)","v":0},0,{"$f":"IMPRIMIR!B48","v":0},{"$f":"IMPRIMIR!C48","v":0},{"$f":"IF(E49=0,0,IMPRIMIR!D48)","v":0},{"$f":"IF(E49=0,0,IMPRIMIR!E48)","v":0},0,0,0]
[null,{"$f":"IF(E50=0,0,IMPRIMIR!A49)","v":0},{"$f":"IF(E50=0,0,IMPRIMIR!$D$3)","v":0},0,{"$f":"IMPRIMIR!B49","v":0},{"$f":"IMPRIMIR!C49","v":0},{"$f":"IF(E50=0,0,IMPRIMIR!D49)","v":0},{"$f":"IF(E50=0,0,IMPRIMIR!E49)","v":0},0,0,0]
[null,{"$f":"IF(E51=0,0,IMPRIMIR!A50)","v":0},{"$f":"IF(E51=0,0,IMPRIMIR!$D$3)","v":0},0,{"$f":"IMPRIMIR!B50","v":0},{"$f":"IMPRIMIR!C50","v":0},{"$f":"IF(E51=0,0,IMPRIMIR!D50)","v":0},{"$f":"IF(E51=0,0,IMPRIMIR!E50)","v":0},0,0,0]
[null,{"$f":"IF(E52=0,0,IMPRIMIR!A51)","v":0},{"$f":"IF(E52=0,0,IMPRIMIR!$D$3)","v":0},0,{"$f":"IMPRIMIR!B51","v":0},{"$f":"IMPRIMIR!C51","v":0},{"$f":"IF(E52=0,0,IMPRIMIR!D51)","v":0},{"$f":"IF(E52=0,0,IMPRIMIR!E51)","v":0},0,0,0]
[null,{"$f":"IF(E53=0,0,IMPRIMIR!A52)","v":0},{"$f":"IF(E53=0,0,IMPRIMIR!$D$3)","v":0},0,{"$f":"IMPRIMIR!B52","v":0},{"$f":"IMPRIMIR!C52","v":0},{"$f":"IF(E53=0,0,IMPRIMIR!D52)","v":0},{"$f":"IF(E53=0,0,IMPRIMIR!E52)","v":0},0,0,0]
[null,{"$f":"IF(E54=0,0,IMPRIMIR!A53)","v":0},{"$f":"IF(E54=0,0,IMPRIMIR!$D$3)","v":0},0,{"$f":"IMPRIMIR!B53","v":0},{"$f":"IMPRIMIR!C53","v":0},{"$f":"IF(E54=0,0,IMPRIMIR!D53)","v":0},{"$f":"IF(E54=0,0,IMPRIMIR!E53)","v":0},0,0,0]
[null,{"$f":"IF(E55=0,0,IMPRIMIR!A54)","v":0},{"$f":"IF(E55=0,0,IMPRIMIR!$D$3)","v":0},0,{"$f":"IMPRIMIR!B54","v":0},{"$f":"IMPRIMIR!C54","v":0},{"$f":"IF(E55=0,0,IMPRIMIR!D54)","v":0},{"$f":"IF(E55=0,0,IMPRIMIR!E54)","v":0},0,0,0]
[null,{"$f":"IF(E56=0,0,IMPRIMIR!A55)","v":0},{"$f":"IF(E56=0,0,IMPRIMIR!$D$3)","v":0},0,{"$f":"IMPRIMIR!B55","v":0},{"$f":"IMPRIMIR!C55","v":0},{"$f":"IF(E56=0,0,IMPRIMIR!D55)","v":0},{"$f":"IF(E56=0,0,IMPRIMIR!E55)","v":0},0,0,0]
[null,{"$f":"IF(E57=0,0,IMPRIMIR!A56)","v":0},{"$f":"IF(E57=0,0,IMPRIMIR!$D$3)","v":0},0,{"$f":"IMPRIMIR!B56","v":0},{"$f":"IMPRIMIR!C56","v":0},{"$f":"IF(E57=0,0,IMPRIMIR!D56)","v":0},{"$f":"IF(E57=0,0,IMPRIMIR!E56)","v":0},0,0,0]
[null,{"$f":"IF(E58=0,0,IMPRIMIR!A57)","v":0},{"$f":"IF(E58=0,0,IMPRIMIR!$D$3)","v":0},0,{"$f":"IMPRIMIR!B57","v":0},{"$f":"IMPRIMIR!C57","v":0},{"$f":"IF(E58=0,0,IMPRIMIR!D57)","v":0},{"$f":"IF(E58=0,0,IMPRIMIR!E57)","v":0},0,0,0]
[null,{"$f":"IF(E59=0,0,IMPRIMIR!A58)","v":0},{"$f":"IF(E59=0,0,IMPRIMIR!$D$3)","v":0},0,{"$f":"IMPRIMIR!B58","v":0},{"$f":"IMPRIMIR!C58","v":0},{"$f":"IF(E59=0,0,IMPRIMIR!D58)","v":0},{"$f":"IF(E59=0,0,IMPRIMIR!E58)","v":0},0,0,0]
[null,{"$f":"IF(E60=0,0,IMPRIMIR!A59)","v":0},{"$f":"IF(E60=0,0,IMPRIMIR!$D$3)","v":0},0,{"$f":"IMPRIMIR!B59","v":0},{"$f":"IMPRIMIR!C59","v":0},{"$f":"IF(E60=0,0,IMPRIMIR!D59)","v":0},{"$f":"IF(E60=0,0,IMPRIMIR!E59)","v":0},0,0,0]
[null,{"$f":"IF(E61=0,0,IMPRIMIR!A60)","v":0},{"$f":"IF(E61=0,0,IMPRIMIR!$D$3)","v":0},0,{"$f":"IMPRIMIR!B60","v":0},{"$f":"IMPRIMIR!C60","v":0},{"$f":"IF(E61=0,0,IMPRIMIR!D60)","v":0},{"$f":"IF(E61=0,0,IMPRIMIR!E60)","v":0},0,0,0]
[null,{"$f":"IF(E62=0,0,IMPRIMIR!A61)","v":0},{"$f":"IF(E62=0,0,IMPRIMIR!$D$3)","v":0},0,{"$f":"IMPRIMIR!B61","v":0},{"$f":"IMPRIMIR!C61","v":0},{"$f":"IF(E62=0,0,IMPRIMIR!D61)","v":0},{"$f":"IF(E62=0,0,IMPRIMIR!E61)","v":0},0,0,0]
[null,{"$f":"IF(E63=0,0,IMPRIMIR!A62)","v":0},{"$f":"IF(E63=0,0,IMPRIMIR!$D$3)","v":0},0,{"$f":"IMPRIMIR!B62","v":0},{"$f":"IMPRIMIR!C62","v":0},{"$f":"IF(E63=0,0,IMPRIMIR!D62)","v":0},{"$f":"IF(E63=0,0,IMPRIMIR!E62)","v":0},0,0,0]
[null,{"$f":"IF(E64=0,0,IMPRIMIR!A63)","v":0},{"$f":"IF(E64=0,0,IMPRIMIR!$D$3)","v":0},0,{"$f":"IMPRIMIR!B63","v":0},{"$f":"IMPRIMIR!C63","v":0},{"$f":"IF(E64=0,0,IMPRIMIR!D63)","v":0},{"$f":"IF(E64=0,0,IMPRIMIR!E63)","v":0},0,0,0]
[null,{"$f":"IF(E65=0,0,IMPRIMIR!A64)","v":0},{"$f":"IF(E65=0,0,IMPRIMIR!$D$3)","v":0},0,{"$f":"IMPRIMIR!B64","v":0},{"$f":"IMPRIMIR!C64","v":0},{"$f":"IF(E65=0,0,IMPRIMIR!D64)","v":0},{"$f":"IF(E65=0,0,IMPRIMIR!E64)","v":0},0,0,0]
[null,{"$f":"IF(E66=0,0,IMPRIMIR!A65)","v":0},{"$f":"IF(E66=0,0,IMPRIMIR!$D$3)","v":0},0,{"$f":"IMPRIMIR!B65","v":0},{"$f":"IMPRIMIR!C65","v":0},{"$f":"IF(E66=0,0,IMPRIMIR!D65)","v":0},{"$f":"IF(E66=0,0,IMPRIMIR!E65)","v":0},0,0,0]
[null,{"$f":"IF(E67=0,0,IMPRIMIR!A66)","v":0},{"$f":"IF(E67=0,0,IMPRIMIR!$D$3)","v":0},0,{"$f":"IMPRIMIR!B66","v":0},{"$f":"IMPRIMIR!C66","v":0},{"$f":"IF(E67=0,0,IMPRIMIR!D66)","v":0},{"$f":"IF(E67=0,0,IMPRIMIR!E66)","v":0},0,0,0]
[null,{"$f":"IF(E68=0,0,IMPRIMIR!A67)","v":0},{"$f":"IF(E68=0,0,IMPRIMIR!$D$3)","v":0},0,{"$f":"IMPRIMIR!B67","v":0},{"$f":"IMPRIMIR!C67","v":0},{"$f":"IF(E68=0,0,IMPRIMIR!D67)","v":0},{"$f":"IF(E68=0,0,IMPRIMIR!E67)","v":0},0,0,0]
[null,{"$f":"IF(E69=0,0,IMPRIMIR!A68)","v":0},{"$f":"IF(E69=0,0,IMPRIMIR!$D$3)","v":0},0,{"$f":"IMPRIMIR!B68","v":0},{"$f":"IMPRIMIR!C68","v":0},{"$f":"IF(E69=0,0,IMPRIMIR!D68)","v":0},{"$f":"IF(E69=0,0,IMPRIMIR!E68)","v":0},0,0,0]
[null,{"$f":"IF(E70=0,0,IMPRIMIR!A69)","v":0},{"$f":"IF(E70=0,0,IMPRIMIR!$D$3)","v":0},0,{"$f":"IMPRIMIR!B69","v":0},{"$f":"IMPRIMIR!C69","v":0},{"$f":"IF(E70=0,0,IMPRIMIR!D69)","v":0},{"$f":"IF(E70=0,0,IMPRIMIR!E69)","v":0},0,0,0]
[null,{"$f":"IF(E71=0,0,IMPRIMIR!A70)","v":0},{"$f":"IF(E71=0,0,IMPRIMIR!$D$3)","v":0},0,{"$f":"IMPRIMIR!B70","v":0},{"$f":"IMPRIMIR!C70","v":0},{"$f":"IF(E71=0,0,IMPRIMIR!D70)","v":0},{"$f":"IF(E71=0,0,IMPRIMIR!E70)","v":0},0,0,0]
[null,{"$f":"IF(E72=0,0,IMPRIMIR!A71)","v":0},{"$f":"IF(E72=0,0,IMPRIMIR!$D$3)","v":0},{"$f":"IF(E72=\"0\",0,$G$2)","v":0},{"$f":"IMPRIMIR!B71","v":0},{"$f":"IMPRIMIR!C71","v":0},{"$f":"IF(E72=0,0,IMPRIMIR!D71)","v":0},{"$f":"IF(E72=0,0,IMPRIMIR!E71)","v":0},{"$f":"IF(E72=0,0,$G$2)","v":0},{"$f":"IF(E72=0,0,$G$4)","v":0},{"$f":"IF(E72=0,0,$G$3)","v":0}]
[null,{"$f":"IF(E73=0,0,IMPRIMIR!A72)","v":0},{"$f":"IF(E73=0,0,IMPRIMIR!$D$3)","v":0},0,{"$f":"IMPRIMIR!B72","v":0},{"$f":"IMPRIMIR!C72","v":0},{"$f":"IF(E73=0,0,IMPRIMIR!D72)","v":0},{"$f":"IF(E73=0,0,IMPRIMIR!E72)","v":0},0,0,0]
[null,{"$f":"IF(E74=0,0,IMPRIMIR!A73)","v":0},{"$f":"IF(E74=0,0,IMPRIMIR!$D$3)","v":0},0,{"$f":"IMPRIMIR!B73","v":0},{"$f":"IMPRIMIR!C73","v":0},{"$f":"IF(E74=0,0,IMPRIMIR!D73)","v":0},{"$f":"IF(E74=0,0,IMPRIMIR!E73)","v":0},0,0,0]
[null,{"$f":"IF(E75=0,0,IMPRIMIR!A74)","v":0},{"$f":"IF(E75=0,0,IMPRIMIR!$D$3)","v":0},0,{"$f":"IMPRIMIR!B74","v":0},{"$f":"IMPRIMIR!C74","v":0},{"$f":"IF(E75=0,0,IMPRIMIR!D74)","v":0},{"$f":"IF(E75=0,0,IMPRIMIR!E74)","v":0},0,0,0]
[null,{"$f":"IF(E76=0,0,IMPRIMIR!A75)","v":0},{"$f":"IF(E76=0,0,IMPRIMIR!$D$3)","v":0},0,{"$f":"IMPRIMIR!B75","v":0},{"$f":"IMPRIMIR!C75","v":0},{"$f":"IF(E76=0,0,IMPRIMIR!D75)","v":0},{"$f":"IF(E76=0,0,IMPRIMIR!E75)","v":0},0,0,0]
[null,{"$f":"IF(E77=0,0,IMPRIMIR!A76)","v":0},{"$f":"IF(E77=0,0,IMPRIMIR!$D$3)","v":0},0,{"$f":"IMPRIMIR!B76","v":0},{"$f":"IMPRIMIR!C76","v":0},{"$f":"IF(E77=0,0,IMPRIMIR!D76)","v":0},{"$f":"IF(E77=0,0,IMPRIMIR!E76)","v":0},0,0,0]
[null,{"$f":"IF(E78=0,0,IMPRIMIR!A77)","v":0},{"$f":"IF(E78=0,0,IMPRIMIR!$D$3)","v":0},0,{"$f":"IMPRIMIR!B77","v":0},{"$f":"IMPRIMIR!C77","v":0},{"$f":"IF(E78=0,0,IMPRIMIR!D77)","v":0},{"$f":"IF(E78=0,0,IMPRIMIR!E77)","v":0},0,0,0]
[null,{"$f":"IF(E79=0,0,IMPRIMIR!A78)","v":0},{"$f":"IF(E79=0,0,IMPRIMIR!$D$3)","v":0},0,{"$f":"IMPRIMIR!B78","v":0},{"$f":"IMPRIMIR!C78","v":0},{"$f":"IF(E79=0,0,IMPRIMIR!D78)","v":0},{"$f":"IF(E79=0,0,IMPRIMIR!E78)","v":0},0,0,0]
[null,{"$f":"IF(E80=0,0,IMPRIMIR!A79)","v":0},{"$f":"IF(E80=0,0,IMPRIMIR!$D$3)","v":0},0,{"$f":"IMPRIMIR!B79","v":0},{"$f":"IMPRIMIR!C79","v":0},{"$f":"IF(E80=0,0,IMPRIMIR!D79)","v":0},{"$f":"IF(E80=0,0,IMPRIMIR!E79)","v":0},0,0,0]
[null,{"$f":"IF(E81=0,0,IMPRIMIR!A80)","v":0},{"$f":"IF(E81=0,0,IMPRIMIR!$D$3)","v":0},0,{"$f":"IMPRIMIR!B80","v":0},{"$f":"IMPRIMIR!C80","v":0},{"$f":"IF(E81=0,0,IMPRIMIR!D80)","v":0},{"$f":"IF(E81=0,0,IMPRIMIR!E80)","v":0},0,0,0]
[null,{"$f":"IF(E82=0,0,IMPRIMIR!A81)","v":0},{"$f":"IF(E82=0,0,IMPRIMIR!$D$3)","v":0},0,{"$f":"IMPRIMIR!B81","v":0},{"$f":"IMPRIMIR!C81","v":0},{"$f":"IF(E82=0,0,IMPRIMIR!D81)","v":0},{"$f":"IF(E82=0,0,IMPRIMIR!E81)","v":0},0,0,0]
[null,{"$f":"IF(E83=0,0,IMPRIMIR!A82)","v":0},{"$f":"IF(E83=0,0,IMPRIMIR!$D$3)","v":0},0,{"$f":"IMPRIMIR!B82","v":0},{"$f":"IMPRIMIR!C82","v":0},{"$f":"IF(E83=0,0,IMPRIMIR!D82)","v":0},{"$f":"IF(E83=0,0,IMPRIMIR!E82)","v":0},0,0,0]
[null,{"$f":"IF(E84=0,0,IMPRIMIR!A83)","v":0},{"$f":"IF(E84=0,0,IMPRIMIR!$D$3)","v":0},0,{"$f":"IMPRIMIR!B83","v":0},{"$f":"IMPRIMIR!C83","v":0},{"$f":"IF(E84=0,0,IMPRIMIR!D83)","v":0},{"$f":"IF(E84=0,0,IMPRIMIR!E83)","v":0},0,0,0]
[null,{"$f":"IF(E85=0,0,IMPRIMIR!A84)","v":0},{"$f":"IF(E85=0,0,IMPRIMIR!$D$3)","v":0},0,{"$f":"IMPRIMIR!B84","v":0},{"$f":"IMPRIMIR!C84","v":0},{"$f":"IF(E85=0,0,IMPRIMIR!D84)","v":0},{"$f":"IF(E85=0,0,IMPRIMIR!E84)","v":0},0,0,0]
[null,{"$f":"IF(E86=0,0,IMPRIMIR!A85)","v":0},{"$f":"IF(E86=0,0,IMPRIMIR!$D$3)","v":0},0,{"$f":"IMPRIMIR!B85","v":0},{"$f":"IMPRIMIR!C85","v":0},{"$f":"IF(E86=0,0,IMPRIMIR!D85)","v":0},{"$f":"IF(E86=0,0,IMPRIMIR!E85)","v":0},0,0,0]
[null,{"$f":"IF(E87=0,0,IMPRIMIR!A86)","v":0},{"$f":"IF(E87=0,0,IMPRIMIR!$D$3)","v":0},0,{"$f":"IMPRIMIR!B86","v":0},{"$f":"IMPRIMIR!C86","v":0},{"$f":"IF(E87=0,0,IMPRIMIR!D86)","v":0},{"$f":"IF(E87=0,0,IMPRIMIR!E86)","v":0},0,0,0]
[null,{"$f":"IF(E88=0,0,IMPRIMIR!A87)","v":0},{"$f":"IF(E88=0,0,IMPRIMIR!$D$3)","v":0},0,{"$f":"IMPRIMIR!B87","v":0},{"$f":"IMPRIMIR!C87","v":0},{"$f":"IF(E88=0,0,IMPRIMIR!D87)","v":0},{"$f":"IF(E88=0,0,IMPRIMIR!E87)","v":0},0,0,0]
[null,{"$f":"IF(E89=0,0,IMPRIMIR!A88)","v":0},{"$f":"IF(E89=0,0,IMPRIMIR!$D$3)","v":0},0,{"$f":"IMPRIMIR!B88","v":0},{"$f":"IMPRIMIR!C88","v":0},{"$f":"IF(E89=0,0,IMPRIMIR!D88)","v":0},{"$f":"IF(E89=0,0,IMPRIMIR!E88)","v":0},0,0,0]
[null,{"$f":"IF(E90=0,0,IMPRIMIR!A89)","v":0},{"$f":"IF(E90=0,0,IMPRIMIR!$D$3)","v":0},0,{"$f":"IMPRIMIR!B89","v":0},{"$f":"IMPRIMIR!C89","v":0},{"$f":"IF(E90=0,0,IMPRIMIR!D89)","v":0},{"$f":"IF(E90=0,0,IMPRIMIR!E89)","v":0},0,0,0]
[null,{"$f":"IF(E91=0,0,IMPRIMIR!A90)","v":0},{"$f":"IF(E91=0,0,IMPRIMIR!$D$3)","v":0},0,{"$f":"IMPRIMIR!B90","v":0},{"$f":"IMPRIMIR!C90","v":0},{"$f":"IF(E91=0,0,IMPRIMIR!D90)","v":0},{"$f":"IF(E91=0,0,IMPRIMIR!E90)","v":0},0,0,0]
[null,{"$f":"IF(E92=0,0,IMPRIMIR!A91)","v":0},{"$f":"IF(E92=0,0,IMPRIMIR!$D$3)","v":0},0,{"$f":"IMPRIMIR!B91","v":0},{"$f":"IMPRIMIR!C91","v":0},{"$f":"IF(E92=0,0,IMPRIMIR!D91)","v":0},{"$f":"IF(E92=0,0,IMPRIMIR!E91)","v":0},0,0,0]
[null,{"$f":"IF(E93=0,0,IMPRIMIR!A92)","v":0},{"$f":"IF(E93=0,0,IMPRIMIR!$D$3)","v":0},0,{"$f":"IMPRIMIR!B92","v":0},{"$f":"IMPRIMIR!C92","v":0},{"$f":"IF(E93=0,0,IMPRIMIR!D92)","v":0},{"$f":"IF(E93=0,0,IMPRIMIR!E92)","v":0},0,0,0]
[null,{"$f":"IF(E94=0,0,IMPRIMIR!A93)","v":0},{"$f":"IF(E94=0,0,IMPRIMIR!$D$3)","v":0},0,{"$f":"IMPRIMIR!B93","v":0},{"$f":"IMPRIMIR!C93","v":0},{"$f":"IF(E94=0,0,IMPRIMIR!D93)","v":0},{"$f":"IF(E94=0,0,IMPRIMIR!E93)","v":0},0,0,0]
[null,{"$f":"IF(E95=0,0,IMPRIMIR!A94)","v":0},{"$f":"IF(E95=0,0,IMPRIMIR!$D$3)","v":0},0,{"$f":"IMPRIMIR!B94","v":0},{"$f":"IMPRIMIR!C94","v":0},{"$f":"IF(E95=0,0,IMPRIMIR!D94)","v":0},{"$f":"IF(E95=0,0,IMPRIMIR!E94)","v":0},0,0,0]
[null,{"$f":"IF(E96=0,0,IMPRIMIR!A95)","v":0},{"$f":"IF(E96=0,0,IMPRIMIR!$D$3)","v":0},0,{"$f":"IMPRIMIR!B95","v":0},{"$f":"IMPRIMIR!C95","v":0},{"$f":"IF(E96=0,0,IMPRIMIR!D95)","v":0},{"$f":"IF(E96=0,0,IMPRIMIR!E95)","v":0},0,0,0]
[null,{"$f":"IF(E97=0,0,IMPRIMIR!A96)","v":0},{"$f":"IF(E97=0,0,IMPRIMIR!$D$3)","v":0},0,{"$f":"IMPRIMIR!B96","v":0},{"$f":"IMPRIMIR!C96","v":0},{"$f":"IF(E97=0,0,IMPRIMIR!D96)","v":0},{"$f":"IF(E97=0,0,IMPRIMIR!E96)","v":0},0,0,0]
[null,{"$f":"IF(E98=0,0,IMPRIMIR!A97)","v":0},{"$f":"IF(E98=0,0,IMPRIMIR!$D$3)","v":0},0,{"$f":"IMPRIMIR!B97","v":0},{"$f":"IMPRIMIR!C97","v":0},{"$f":"IF(E98=0,0,IMPRIMIR!D97)","v":0},{"$f":"IF(E98=0,0,IMPRIMIR!E97)","v":0},0,0,0]
[null,{"$f":"IF(E99=0,0,IMPRIMIR!A98)","v":0},{"$f":"IF(E99=0,0,IMPRIMIR!$D$3)","v":0},0,{"$f":"IMPRIMIR!B98","v":0},{"$f":"IMPRIMIR!C98","v":0},{"$f":"IF(E99=0,0,IMPRIMIR!D98)","v":0},{"$f":"IF(E99=0,0,IMPRIMIR!E98)","v":0},0,0,0]
[null,{"$f":"IF(E100=0,0,IMPRIMIR!A99)","v":0},{"$f":"IF(E100=0,0,IMPRIMIR!$D$3)","v":0},0,{"$f":"IMPRIMIR!B99","v":0},{"$f":"IMPRIMIR!C99","v":0},{"$f":"IF(E100=0,0,IMPRIMIR!D99)","v":0},{"$f":"IF(E100=0,0,IMPRIMIR!E99)","v":0},0,0,0]
[null,{"$f":"IF(E101=0,0,IMPRIMIR!A100)","v":0},{"$f":"IF(E101=0,0,IMPRIMIR!$D$3)","v":0},0,{"$f":"IMPRIMIR!B100","v":0},{"$f":"IMPRIMIR!C100","v":0},{"$f":"IF(E101=0,0,IMPRIMIR!D100)","v":0},{"$f":"IF(E101=0,0,IMPRIMIR!E100)","v":0},0,0,0]
[null,{"$f":"IF(E102=0,0,IMPRIMIR!A101)","v":0},{"$f":"IF(E102=0,0,IMPRIMIR!$D$3)","v":0},0,{"$f":"IMPRIMIR!B101","v":0},{"$f":"IMPRIMIR!C101","v":0},{"$f":"IF(E102=0,0,IMPRIMIR!D101)","v":0},{"$f":"IF(E102=0,0,IMPRIMIR!E101)","v":0},0,0,0]
[null,{"$f":"IF(E103=0,0,IMPRIMIR!A102)","v":0},{"$f":"IF(E103=0,0,IMPRIMIR!$D$3)","v":0},0,{"$f":"IMPRIMIR!B102","v":0},{"$f":"IMPRIMIR!C102","v":0},{"$f":"IF(E103=0,0,IMPRIMIR!D102)","v":0},{"$f":"IF(E103=0,0,IMPRIMIR!E102)","v":0},0,0,0]
[null,{"$f":"IF(E104=0,0,IMPRIMIR!A103)","v":0},{"$f":"IF(E104=0,0,IMPRIMIR!$D$3)","v":0},0,{"$f":"IMPRIMIR!B103","v":0},{"$f":"IMPRIMIR!C103","v":0},{"$f":"IF(E104=0,0,IMPRIMIR!D103)","v":0},{"$f":"IF(E104=0,0,IMPRIMIR!E103)","v":0},0,0,0]
[null,{"$f":"IF(E105=0,0,IMPRIMIR!A104)","v":0},{"$f":"IF(E105=0,0,IMPRIMIR!$D$3)","v":0},0,{"$f":"IMPRIMIR!B104","v":0},{"$f":"IMPRIMIR!C104","v":0},{"$f":"IF(E105=0,0,IMPRIMIR!D104)","v":0},{"$f":"IF(E105=0,0,IMPRIMIR!E104)","v":0},0,0,0]
[null,{"$f":"IF(E106=0,0,IMPRIMIR!A105)","v":0},{"$f":"IF(E106=0,0,IMPRIMIR!$D$3)","v":0},0,{"$f":"IMPRIMIR!B105","v":0},{"$f":"IMPRIMIR!C105","v":0},{"$f":"IF(E106=0,0,IMPRIMIR!D105)","v":0},{"$f":"IF(E106=0,0,IMPRIMIR!E105)","v":0},0,0,0]
[null,{"$f":"IF(E107=0,0,IMPRIMIR!A106)","v":0},{"$f":"IF(E107=0,0,IMPRIMIR!$D$3)","v":0},0,{"$f":"IMPRIMIR!B106","v":0},{"$f":"IMPRIMIR!C106","v":0},{"$f":"IF(E107=0,0,IMPRIMIR!D106)","v":0},{"$f":"IF(E107=0,0,IMPRIMIR!E106)","v":0},0,0,0]
[null,{"$f":"IF(E108=0,0,IMPRIMIR!A107)","v":0},{"$f":"IF(E108=0,0,IMPRIMIR!$D$3)","v":0},0,{"$f":"IMPRIMIR!B107","v":0},{"$f":"IMPRIMIR!C107","v":0},{"$f":"IF(E108=0,0,IMPRIMIR!D107)","v":0},{"$f":"IF(E108=0,0,IMPRIMIR!E107)","v":0},0,0,0]
[null,{"$f":"IF(E109=0,0,IMPRIMIR!A108)","v":0},{"$f":"IF(E109=0,0,IMPRIMIR!$D$3)","v":0},0,{"$f":"IMPRIMIR!B108","v":0},{"$f":"IMPRIMIR!C108","v":0},{"$f":"IF(E109=0,0,IMPRIMIR!D108)","v":0},{"$f":"IF(E109=0,0,IMPRIMIR!E108)","v":0},0,0,0]
[null,{"$f":"IF(E110=0,0,IMPRIMIR!A109)","v":0},{"$f":"IF(E110=0,0,IMPRIMIR!$D$3)","v":0},0,{"$f":"IMPRIMIR!B109","v":0},{"$f":"IMPRIMIR!C109","v":0},{"$f":"IF(E110=0,0,IMPRIMIR!D109)","v":0},{"$f":"IF(E110=0,0,IMPRIMIR!E109)","v":0},0,0,0]
[null,{"$f":"IF(E111=0,0,IMPRIMIR!A110)","v":0},{"$f":"IF(E111=0,0,IMPRIMIR!$D$3)","v":0},0,{"$f":"IMPRIMIR!B110","v":0},{"$f":"IMPRIMIR!C110","v":0},{"$f":"IF(E111=0,0,IMPRIMIR!D110)","v":0},{"$f":"IF(E111=0,0,IMPRIMIR!E110)","v":0},0,0,0]
[null,{"$f":"IF(E112=0,0,IMPRIMIR!A111)","v":0},{"$f":"IF(E112=0,0,IMPRIMIR!$D$3)","v":0},0,{"$f":"IMPRIMIR!B111","v":0},{"$f":"IMPRIMIR!C111","v":0},{"$f":"IF(E112=0,0,IMPRIMIR!D111)","v":0},{"$f":"IF(E112=0,0,IMPRIMIR!E111)","v":0},0,0,0]
[null,{"$f":"IF(E113=0,0,IMPRIMIR!A112)","v":0},{"$f":"IF(E113=0,0,IMPRIMIR!$D$3)","v":0},0,{"$f":"IMPRIMIR!B112","v":0},{"$f":"IMPRIMIR!C112","v":0},{"$f":"IF(E113=0,0,IMPRIMIR!D112)","v":0},{"$f":"IF(E113=0,0,IMPRIMIR!E112)","v":0},0,0,0]
[null,{"$f":"IF(E114=0,0,IMPRIMIR!A113)","v":0},{"$f":"IF(E114=0,0,IMPRIMIR!$D$3)","v":0},0,{"$f":"IMPRIMIR!B113","v":0},{"$f":"IMPRIMIR!C113","v":0},{"$f":"IF(E114=0,0,IMPRIMIR!D113)","v":0},{"$f":"IF(E114=0,0,IMPRIMIR!E113)","v":0},0,0,0]
[null,{"$f":"IF(E115=0,0,IMPRIMIR!A114)","v":0},{"$f":"IF(E115=0,0,IMPRIMIR!$D$3)","v":0},0,{"$f":"IMPRIMIR!B114","v":0},{"$f":"IMPRIMIR!C114","v":0},{"$f":"IF(E115=0,0,IMPRIMIR!D114)","v":0},{"$f":"IF(E115=0,0,IMPRIMIR!E114)","v":0},0,0,0]
[null,{"$f":"IF(E116=0,0,IMPRIMIR!A115)","v":0},{"$f":"IF(E116=0,0,IMPRIMIR!$D$3)","v":0},0,{"$f":"IMPRIMIR!B115","v":0},{"$f":"IMPRIMIR!C115","v":0},{"$f":"IF(E116=0,0,IMPRIMIR!D115)","v":0},{"$f":"IF(E116=0,0,IMPRIMIR!E115)","v":0},0,0,0]
[null,{"$f":"IF(E117=0,0,IMPRIMIR!A116)","v":0},{"$f":"IF(E117=0,0,IMPRIMIR!$D$3)","v":0},0,{"$f":"IMPRIMIR!B116","v":0},{"$f":"IMPRIMIR!C116","v":0},{"$f":"IF(E117=0,0,IMPRIMIR!D116)","v":0},{"$f":"IF(E117=0,0,IMPRIMIR!E116)","v":0},0,0,0]
[null,{"$f":"IF(E118=0,0,IMPRIMIR!A117)","v":0},{"$f":"IF(E118=0,0,IMPRIMIR!$D$3)","v":0},0,{"$f":"IMPRIMIR!B117","v":0},{"$f":"IMPRIMIR!C117","v":0},{"$f":"IF(E118=0,0,IMPRIMIR!D117)","v":0},{"$f":"IF(E118=0,0,IMPRIMIR!E117)","v":0},0,0,0]
[null,{"$f":"IF(E119=0,0,IMPRIMIR!A118)","v":0},{"$f":"IF(E119=0,0,IMPRIMIR!$D$3)","v":0},0,{"$f":"IMPRIMIR!B118","v":0},{"$f":"IMPRIMIR!C118","v":0},{"$f":"IF(E119=0,0,IMPRIMIR!D118)","v":0},{"$f":"IF(E119=0,0,IMPRIMIR!E118)","v":0},0,0,0]
[null,{"$f":"IF(E120=0,0,IMPRIMIR!A119)","v":0},{"$f":"IF(E120=0,0,IMPRIMIR!$D$3)","v":0},0,{"$f":"IMPRIMIR!B119","v":0},{"$f":"IMPRIMIR!C119","v":0},{"$f":"IF(E120=0,0,IMPRIMIR!D119)","v":0},{"$f":"IF(E120=0,0,IMPRIMIR!E119)","v":0},0,0,0]
[null,{"$f":"IF(E121=0,0,IMPRIMIR!A120)","v":0},{"$f":"IF(E121=0,0,IMPRIMIR!$D$3)","v":0},0,{"$f":"IMPRIMIR!B120","v":0},{"$f":"IMPRIMIR!C120","v":0},{"$f":"IF(E121=0,0,IMPRIMIR!D120)","v":0},{"$f":"IF(E121=0,0,IMPRIMIR!E120)","v":0},0,0,0]
[null,{"$f":"IF(E122=0,0,IMPRIMIR!A121)","v":0},{"$f":"IF(E122=0,0,IMPRIMIR!$D$3)","v":0},0,{"$f":"IMPRIMIR!B121","v":0},{"$f":"IMPRIMIR!C121","v":0},{"$f":"IF(E122=0,0,IMPRIMIR!D121)","v":0},{"$f":"IF(E122=0,0,IMPRIMIR!E121)","v":0},0,0,0]
[null,{"$f":"IF(E123=0,0,IMPRIMIR!A122)","v":0},{"$f":"IF(E123=0,0,IMPRIMIR!$D$3)","v":0},0,{"$f":"IMPRIMIR!B122","v":0},{"$f":"IMPRIMIR!C122","v":0},{"$f":"IF(E123=0,0,IMPRIMIR!D122)","v":0},{"$f":"IF(E123=0,0,IMPRIMIR!E122)","v":0},0,0,0]
[null,{"$f":"IF(E124=0,0,IMPRIMIR!A123)","v":0},{"$f":"IF(E124=0,0,IMPRIMIR!$D$3)","v":0},0,{"$f":"IMPRIMIR!B123","v":0},{"$f":"IMPRIMIR!C123","v":0},{"$f":"IF(E124=0,0,IMPRIMIR!D123)","v":0},{"$f":"IF(E124=0,0,IMPRIMIR!E123)","v":0},0,0,0]
[null,{"$f":"IF(E125=0,0,IMPRIMIR!A124)","v":0},{"$f":"IF(E125=0,0,IMPRIMIR!$D$3)","v":0},0,{"$f":"IMPRIMIR!B124","v":0},{"$f":"IMPRIMIR!C124","v":0},{"$f":"IF(E125=0,0,IMPRIMIR!D124)","v":0},{"$f":"IF(E125=0,0,IMPRIMIR!E124)","v":0},0,0,0]
[null,{"$f":"IF(E126=0,0,IMPRIMIR!A125)","v":0},{"$f":"IF(E126=0,0,IMPRIMIR!$D$3)","v":0},0,{"$f":"IMPRIMIR!B125","v":0},{"$f":"IMPRIMIR!C125","v":0},{"$f":"IF(E126=0,0,IMPRIMIR!D125)","v":0},{"$f":"IF(E126=0,0,IMPRIMIR!E125)","v":0},0,0,0]
[null,{"$f":"IF(E127=0,0,IMPRIMIR!A126)","v":0},{"$f":"IF(E127=0,0,IMPRIMIR!$D$3)","v":0},0,{"$f":"IMPRIMIR!B126","v":0},{"$f":"IMPRIMIR!C126","v":0},{"$f":"IF(E127=0,0,IMPRIMIR!D126)","v":0},{"$f":"IF(E127=0,0,IMPRIMIR!E126)","v":0},0,0,0]
[null,{"$f":"IF(E128=0,0,IMPRIMIR!A127)","v":0},{"$f":"IF(E128=0,0,IMPRIMIR!$D$3)","v":0},0,{"$f":"IMPRIMIR!B127","v":0},{"$f":"IMPRIMIR!C127","v":0},{"$f":"IF(E128=0,0,IMPRIMIR!D127)","v":0},{"$f":"IF(E128=0,0,IMPRIMIR!E127)","v":0},0,0,0]
[null,{"$f":"IF(E129=0,0,IMPRIMIR!A128)","v":0},{"$f":"IF(E129=0,0,IMPRIMIR!$D$3)","v":0},0,{"$f":"IMPRIMIR!B128","v":0},{"$f":"IMPRIMIR!C128","v":0},{"$f":"IF(E129=0,0,IMPRIMIR!D128)","v":0},{"$f":"IF(E129=0,0,IMPRIMIR!E128)","v":0},0,0,0]
[null,{"$f":"IF(E130=0,0,IMPRIMIR!A129)","v":0},{"$f":"IF(E130=0,0,IMPRIMIR!$D$3)","v":0},0,{"$f":"IMPRIMIR!B129","v":0},{"$f":"IMPRIMIR!C129","v":0},{"$f":"IF(E130=0,0,IMPRIMIR!D129)","v":0},{"$f":"IF(E130=0,0,IMPRIMIR!E129)","v":0},0,0,0]
[null,{"$f":"IF(E131=0,0,IMPRIMIR!A130)","v":0},{"$f":"IF(E131=0,0,IMPRIMIR!$D$3)","v":0},0,{"$f":"IMPRIMIR!B130","v":0},{"$f":"IMPRIMIR!C130","v":0},{"$f":"IF(E131=0,0,IMPRIMIR!D130)","v":0},{"$f":"IF(E131=0,0,IMPRIMIR!E130)","v":0},0,0,0]
[null,{"$f":"IF(E132=0,0,IMPRIMIR!A131)","v":0},{"$f":"IF(E132=0,0,IMPRIMIR!$D$3)","v":0},0,{"$f":"IMPRIMIR!B131","v":0},{"$f":"IMPRIMIR!C131","v":0},{"$f":"IF(E132=0,0,IMPRIMIR!D131)","v":0},{"$f":"IF(E132=0,0,IMPRIMIR!E131)","v":0},0,0,0]
[null,{"$f":"IF(E133=0,0,IMPRIMIR!A132)","v":0},{"$f":"IF(E133=0,0,IMPRIMIR!$D$3)","v":0},0,{"$f":"IMPRIMIR!B132","v":0},{"$f":"IMPRIMIR!C132","v":0},{"$f":"IF(E133=0,0,IMPRIMIR!D132)","v":0},{"$f":"IF(E133=0,0,IMPRIMIR!E132)","v":0},0,0,0]
[null,{"$f":"IF(E134=0,0,IMPRIMIR!A133)","v":0},{"$f":"IF(E134=0,0,IMPRIMIR!$D$3)","v":0},0,{"$f":"IMPRIMIR!B133","v":0},{"$f":"IMPRIMIR!C133","v":0},{"$f":"IF(E134=0,0,IMPRIMIR!D133)","v":0},{"$f":"IF(E134=0,0,IMPRIMIR!E133)","v":0},0,0,0]
[null,{"$f":"IF(E135=0,0,IMPRIMIR!A134)","v":0},{"$f":"IF(E135=0,0,IMPRIMIR!$D$3)","v":0},0,{"$f":"IMPRIMIR!B134","v":0},{"$f":"IMPRIMIR!C134","v":0},{"$f":"IF(E135=0,0,IMPRIMIR!D134)","v":0},{"$f":"IF(E135=0,0,IMPRIMIR!E134)","v":0},0,0,0]
[null,{"$f":"IF(E136=0,0,IMPRIMIR!A135)","v":0},{"$f":"IF(E136=0,0,IMPRIMIR!$D$3)","v":0},{"$f":"IF(E136=\"0\",0,$G$2)","v":0},{"$f":"IMPRIMIR!B135","v":0},{"$f":"IMPRIMIR!C135","v":0},{"$f":"IF(E136=0,0,IMPRIMIR!D135)","v":0},{"$f":"IF(E136=0,0,IMPRIMIR!E135)","v":0},{"$f":"IF(E136=0,0,$G$2)","v":0},{"$f":"IF(E136=0,0,$G$4)","v":0},{"$f":"IF(E136=0,0,$G$3)","v":0}]
[null,{"$f":"IF(E137=0,0,IMPRIMIR!A136)","v":0},{"$f":"IF(E137=0,0,IMPRIMIR!$D$3)","v":0},0,{"$f":"IMPRIMIR!B136","v":0},{"$f":"IMPRIMIR!C136","v":0},{"$f":"IF(E137=0,0,IMPRIMIR!D136)","v":0},{"$f":"IF(E137=0,0,IMPRIMIR!E136)","v":0},0,0,0]
[null,{"$f":"IF(E138=0,0,IMPRIMIR!A137)","v":0},{"$f":"IF(E138=0,0,IMPRIMIR!$D$3)","v":0},0,{"$f":"IMPRIMIR!B137","v":0},{"$f":"IMPRIMIR!C137","v":0},{"$f":"IF(E138=0,0,IMPRIMIR!D137)","v":0},{"$f":"IF(E138=0,0,IMPRIMIR!E137)","v":0},0,0,0]
[null,{"$f":"IF(E139=0,0,IMPRIMIR!A138)","v":0},{"$f":"IF(E139=0,0,IMPRIMIR!$D$3)","v":0},0,{"$f":"IMPRIMIR!B138","v":0},{"$f":"IMPRIMIR!C138","v":0},{"$f":"IF(E139=0,0,IMPRIMIR!D138)","v":0},{"$f":"IF(E139=0,0,IMPRIMIR!E138)","v":0},0,0,0]
[null,{"$f":"IF(E140=0,0,IMPRIMIR!A139)","v":0},{"$f":"IF(E140=0,0,IMPRIMIR!$D$3)","v":0},0,{"$f":"IMPRIMIR!B139","v":0},{"$f":"IMPRIMIR!C139","v":0},{"$f":"IF(E140=0,0,IMPRIMIR!D139)","v":0},{"$f":"IF(E140=0,0,IMPRIMIR!E139)","v":0},0,0,0]
[null,{"$f":"IF(E141=0,0,IMPRIMIR!A140)","v":0},{"$f":"IF(E141=0,0,IMPRIMIR!$D$3)","v":0},0,{"$f":"IMPRIMIR!B140","v":0},{"$f":"IMPRIMIR!C140","v":0},{"$f":"IF(E141=0,0,IMPRIMIR!D140)","v":0},{"$f":"IF(E141=0,0,IMPRIMIR!E140)","v":0},0,0,0]
[null,{"$f":"IF(E142=0,0,IMPRIMIR!A141)","v":0},{"$f":"IF(E142=0,0,IMPRIMIR!$D$3)","v":0},0,{"$f":"IMPRIMIR!B141","v":0},{"$f":"IMPRIMIR!C141","v":0},{"$f":"IF(E142=0,0,IMPRIMIR!D141)","v":0},{"$f":"IF(E142=0,0,IMPRIMIR!E141)","v":0},0,0,0]
[null,{"$f":"IF(E143=0,0,IMPRIMIR!A142)","v":0},{"$f":"IF(E143=0,0,IMPRIMIR!$D$3)","v":0},0,{"$f":"IMPRIMIR!B142","v":0},{"$f":"IMPRIMIR!C142","v":0},{"$f":"IF(E143=0,0,IMPRIMIR!D142)","v":0},{"$f":"IF(E143=0,0,IMPRIMIR!E142)","v":0},0,0,0]
[null,{"$f":"IF(E144=0,0,IMPRIMIR!A143)","v":0},{"$f":"IF(E144=0,0,IMPRIMIR!$D$3)","v":0},0,{"$f":"IMPRIMIR!B143","v":0},{"$f":"IMPRIMIR!C143","v":0},{"$f":"IF(E144=0,0,IMPRIMIR!D143)","v":0},{"$f":"IF(E144=0,0,IMPRIMIR!E143)","v":0},0,0,0]
[null,{"$f":"IF(E145=0,0,IMPRIMIR!A144)","v":0},{"$f":"IF(E145=0,0,IMPRIMIR!$D$3)","v":0},0,{"$f":"IMPRIMIR!B144","v":0},{"$f":"IMPRIMIR!C144","v":0},{"$f":"IF(E145=0,0,IMPRIMIR!D144)","v":0},{"$f":"IF(E145=0,0,IMPRIMIR!E144)","v":0},0,0,0]
[null,{"$f":"IF(E146=0,0,IMPRIMIR!A145)","v":0},{"$f":"IF(E146=0,0,IMPRIMIR!$D$3)","v":0},0,{"$f":"IMPRIMIR!B145","v":0},{"$f":"IMPRIMIR!C145","v":0},{"$f":"IF(E146=0,0,IMPRIMIR!D145)","v":0},{"$f":"IF(E146=0,0,IMPRIMIR!E145)","v":0},0,0,0]
[null,{"$f":"IF(E147=0,0,IMPRIMIR!A146)","v":0},{"$f":"IF(E147=0,0,IMPRIMIR!$D$3)","v":0},0,{"$f":"IMPRIMIR!B146","v":0},{"$f":"IMPRIMIR!C146","v":0},{"$f":"IF(E147=0,0,IMPRIMIR!D146)","v":0},{"$f":"IF(E147=0,0,IMPRIMIR!E146)","v":0},0,0,0]
[null,{"$f":"IF(E148=0,0,IMPRIMIR!A147)","v":0},{"$f":"IF(E148=0,0,IMPRIMIR!$D$3)","v":0},0,{"$f":"IMPRIMIR!B147","v":0},{"$f":"IMPRIMIR!C147","v":0},{"$f":"IF(E148=0,0,IMPRIMIR!D147)","v":0},{"$f":"IF(E148=0,0,IMPRIMIR!E147)","v":0},0,0,0]
[null,{"$f":"IF(E149=0,0,IMPRIMIR!A148)","v":0},{"$f":"IF(E149=0,0,IMPRIMIR!$D$3)","v":0},0,{"$f":"IMPRIMIR!B148","v":0},{"$f":"IMPRIMIR!C148","v":0},{"$f":"IF(E149=0,0,IMPRIMIR!D148)","v":0},{"$f":"IF(E149=0,0,IMPRIMIR!E148)","v":0},0,0,0]
[null,{"$f":"IF(E150=0,0,IMPRIMIR!A149)","v":0},{"$f":"IF(E150=0,0,IMPRIMIR!$D$3)","v":0},0,{"$f":"IMPRIMIR!B149","v":0},{"$f":"IMPRIMIR!C149","v":0},{"$f":"IF(E150=0,0,IMPRIMIR!D149)","v":0},{"$f":"IF(E150=0,0,IMPRIMIR!E149)","v":0},0,0,0]
[null,{"$f":"IF(E151=0,0,IMPRIMIR!A150)","v":0},{"$f":"IF(E151=0,0,IMPRIMIR!$D$3)","v":0},0,{"$f":"IMPRIMIR!B150","v":0},{"$f":"IMPRIMIR!C150","v":0},{"$f":"IF(E151=0,0,IMPRIMIR!D150)","v":0},{"$f":"IF(E151=0,0,IMPRIMIR!E150)","v":0},0,0,0]
[null,{"$f":"IF(E152=0,0,IMPRIMIR!A151)","v":0},{"$f":"IF(E152=0,0,IMPRIMIR!$D$3)","v":0},0,{"$f":"IMPRIMIR!B151","v":0},{"$f":"IMPRIMIR!C151","v":0},{"$f":"IF(E152=0,0,IMPRIMIR!D151)","v":0},{"$f":"IF(E152=0,0,IMPRIMIR!E151)","v":0},0,0,0]
[null,{"$f":"IF(E153=0,0,IMPRIMIR!A152)","v":0},{"$f":"IF(E153=0,0,IMPRIMIR!$D$3)","v":0},0,{"$f":"IMPRIMIR!B152","v":0},{"$f":"IMPRIMIR!C152","v":0},{"$f":"IF(E153=0,0,IMPRIMIR!D152)","v":0},{"$f":"IF(E153=0,0,IMPRIMIR!E152)","v":0},0,0,0]
[null,{"$f":"IF(E154=0,0,IMPRIMIR!A153)","v":0},{"$f":"IF(E154=0,0,IMPRIMIR!$D$3)","v":0},0,{"$f":"IMPRIMIR!B153","v":0},{"$f":"IMPRIMIR!C153","v":0},{"$f":"IF(E154=0,0,IMPRIMIR!D153)","v":0},{"$f":"IF(E154=0,0,IMPRIMIR!E153)","v":0},0,0,0]
[null,{"$f":"IF(E155=0,0,IMPRIMIR!A154)","v":0},{"$f":"IF(E155=0,0,IMPRIMIR!$D$3)","v":0},0,{"$f":"IMPRIMIR!B154","v":0},{"$f":"IMPRIMIR!C154","v":0},{"$f":"IF(E155=0,0,IMPRIMIR!D154)","v":0},{"$f":"IF(E155=0,0,IMPRIMIR!E154)","v":0},0,0,0]
[null,{"$f":"IF(E156=0,0,IMPRIMIR!A155)","v":0},{"$f":"IF(E156=0,0,IMPRIMIR!$D$3)","v":0},0,{"$f":"IMPRIMIR!B155","v":0},{"$f":"IMPRIMIR!C155","v":0},{"$f":"IF(E156=0,0,IMPRIMIR!D155)","v":0},{"$f":"IF(E156=0,0,IMPRIMIR!E155)","v":0},0,0,0]
[null,{"$f":"IF(E157=0,0,IMPRIMIR!A156)","v":0},{"$f":"IF(E157=0,0,IMPRIMIR!$D$3)","v":0},0,{"$f":"IMPRIMIR!B156","v":0},{"$f":"IMPRIMIR!C156","v":0},{"$f":"IF(E157=0,0,IMPRIMIR!D156)","v":0},{"$f":"IF(E157=0,0,IMPRIMIR!E156)","v":0},0,0,0]
[null,{"$f":"IF(E158=0,0,IMPRIMIR!A157)","v":0},{"$f":"IF(E158=0,0,IMPRIMIR!$D$3)","v":0},0,{"$f":"IMPRIMIR!B157","v":0},{"$f":"IMPRIMIR!C157","v":0},{"$f":"IF(E158=0,0,IMPRIMIR!D157)","v":0},{"$f":"IF(E158=0,0,IMPRIMIR!E157)","v":0},0,0,0]
[null,{"$f":"IF(E159=0,0,IMPRIMIR!A158)","v":0},{"$f":"IF(E159=0,0,IMPRIMIR!$D$3)","v":0},0,{"$f":"IMPRIMIR!B158","v":0},{"$f":"IMPRIMIR!C158","v":0},{"$f":"IF(E159=0,0,IMPRIMIR!D158)","v":0},{"$f":"IF(E159=0,0,IMPRIMIR!E158)","v":0},0,0,0]
[null,{"$f":"IF(E160=0,0,IMPRIMIR!A159)","v":0},{"$f":"IF(E160=0,0,IMPRIMIR!$D$3)","v":0},0,{"$f":"IMPRIMIR!B159","v":0},{"$f":"IMPRIMIR!C159","v":0},{"$f":"IF(E160=0,0,IMPRIMIR!D159)","v":0},{"$f":"IF(E160=0,0,IMPRIMIR!E159)","v":0},0,0,0]
[null,{"$f":"IF(E161=0,0,IMPRIMIR!A160)","v":0},{"$f":"IF(E161=0,0,IMPRIMIR!$D$3)","v":0},0,{"$f":"IMPRIMIR!B160","v":0},{"$f":"IMPRIMIR!C160","v":0},{"$f":"IF(E161=0,0,IMPRIMIR!D160)","v":0},{"$f":"IF(E161=0,0,IMPRIMIR!E160)","v":0},0,0,0]
[null,{"$f":"IF(E162=0,0,IMPRIMIR!A161)","v":0},{"$f":"IF(E162=0,0,IMPRIMIR!$D$3)","v":0},0,{"$f":"IMPRIMIR!B161","v":0},{"$f":"IMPRIMIR!C161","v":0},{"$f":"IF(E162=0,0,IMPRIMIR!D161)","v":0},{"$f":"IF(E162=0,0,IMPRIMIR!E161)","v":0},0,0,0]
[null,{"$f":"IF(E163=0,0,IMPRIMIR!A162)","v":0},{"$f":"IF(E163=0,0,IMPRIMIR!$D$3)","v":0},0,{"$f":"IMPRIMIR!B162","v":0},{"$f":"IMPRIMIR!C162","v":0},{"$f":"IF(E163=0,0,IMPRIMIR!D162)","v":0},{"$f":"IF(E163=0,0,IMPRIMIR!E162)","v":0},0,0,0]
[null,{"$f":"IF(E164=0,0,IMPRIMIR!A163)","v":0},{"$f":"IF(E164=0,0,IMPRIMIR!$D$3)","v":0},0,{"$f":"IMPRIMIR!B163","v":0},{"$f":"IMPRIMIR!C163","v":0},{"$f":"IF(E164=0,0,IMPRIMIR!D163)","v":0},{"$f":"IF(E164=0,0,IMPRIMIR!E163)","v":0},0,0,0]
[null,{"$f":"IF(E165=0,0,IMPRIMIR!A164)","v":0},{"$f":"IF(E165=0,0,IMPRIMIR!$D$3)","v":0},0,{"$f":"IMPRIMIR!B164","v":0},{"$f":"IMPRIMIR!C164","v":0},{"$f":"IF(E165=0,0,IMPRIMIR!D164)","v":0},{"$f":"IF(E165=0,0,IMPRIMIR!E164)","v":0},0,0,0]
[null,{"$f":"IF(E166=0,0,IMPRIMIR!A165)","v":0},{"$f":"IF(E166=0,0,IMPRIMIR!$D$3)","v":0},0,{"$f":"IMPRIMIR!B165","v":0},{"$f":"IMPRIMIR!C165","v":0},{"$f":"IF(E166=0,0,IMPRIMIR!D165)","v":0},{"$f":"IF(E166=0,0,IMPRIMIR!E165)","v":0},0,0,0]
[null,{"$f":"IF(E167=0,0,IMPRIMIR!A166)","v":0},{"$f":"IF(E167=0,0,IMPRIMIR!$D$3)","v":0},0,{"$f":"IMPRIMIR!B166","v":0},{"$f":"IMPRIMIR!C166","v":0},{"$f":"IF(E167=0,0,IMPRIMIR!D166)","v":0},{"$f":"IF(E167=0,0,IMPRIMIR!E166)","v":0},0,0,0]
[null,{"$f":"IF(E168=0,0,IMPRIMIR!A167)","v":0},{"$f":"IF(E168=0,0,IMPRIMIR!$D$3)","v":0},0,{"$f":"IMPRIMIR!B167","v":0},{"$f":"IMPRIMIR!C167","v":0},{"$f":"IF(E168=0,0,IMPRIMIR!D167)","v":0},{"$f":"IF(E168=0,0,IMPRIMIR!E167)","v":0},0,0,0]
[null,{"$f":"IF(E169=0,0,IMPRIMIR!A168)","v":0},{"$f":"IF(E169=0,0,IMPRIMIR!$D$3)","v":0},0,{"$f":"IMPRIMIR!B168","v":0},{"$f":"IMPRIMIR!C168","v":0},{"$f":"IF(E169=0,0,IMPRIMIR!D168)","v":0},{"$f":"IF(E169=0,0,IMPRIMIR!E168)","v":0},0,0,0]
[null,{"$f":"IF(E170=0,0,IMPRIMIR!A169)","v":0},{"$f":"IF(E170=0,0,IMPRIMIR!$D$3)","v":0},0,{"$f":"IMPRIMIR!B169","v":0},{"$f":"IMPRIMIR!C169","v":0},{"$f":"IF(E170=0,0,IMPRIMIR!D169)","v":0},{"$f":"IF(E170=0,0,IMPRIMIR!E169)","v":0},0,0,0]
[null,{"$f":"IF(E171=0,0,IMPRIMIR!A170)","v":0},{"$f":"IF(E171=0,0,IMPRIMIR!$D$3)","v":0},0,{"$f":"IMPRIMIR!B170","v":0},{"$f":"IMPRIMIR!C170","v":0},{"$f":"IF(E171=0,0,IMPRIMIR!D170)","v":0},{"$f":"IF(E171=0,0,IMPRIMIR!E170)","v":0},0,0,0]
[null,{"$f":"IF(E172=0,0,IMPRIMIR!A171)","v":0},{"$f":"IF(E172=0,0,IMPRIMIR!$D$3)","v":0},0,{"$f":"IMPRIMIR!B171","v":0},{"$f":"IMPRIMIR!C171","v":0},{"$f":"IF(E172=0,0,IMPRIMIR!D171)","v":0},{"$f":"IF(E172=0,0,IMPRIMIR!E171)","v":0},0,0,0]
[null,{"$f":"IF(E173=0,0,IMPRIMIR!A172)","v":0},{"$f":"IF(E173=0,0,IMPRIMIR!$D$3)","v":0},0,{"$f":"IMPRIMIR!B172","v":0},{"$f":"IMPRIMIR!C172","v":0},{"$f":"IF(E173=0,0,IMPRIMIR!D172)","v":0},{"$f":"IF(E173=0,0,IMPRIMIR!E172)","v":0},0,0,0]
[null,{"$f":"IF(E174=0,0,IMPRIMIR!A173)","v":0},{"$f":"IF(E174=0,0,IMPRIMIR!$D$3)","v":0},0,{"$f":"IMPRIMIR!B173","v":0},{"$f":"IMPRIMIR!C173","v":0},{"$f":"IF(E174=0,0,IMPRIMIR!D173)","v":0},{"$f":"IF(E174=0,0,IMPRIMIR!E173)","v":0},0,0,0]
[null,{"$f":"IF(E175=0,0,IMPRIMIR!A174)","v":0},{"$f":"IF(E175=0,0,IMPRIMIR!$D$3)","v":0},0,{"$f":"IMPRIMIR!B174","v":0},{"$f":"IMPRIMIR!C174","v":0},{"$f":"IF(E175=0,0,IMPRIMIR!D174)","v":0},{"$f":"IF(E175=0,0,IMPRIMIR!E174)","v":0},0,0,0]
[null,{"$f":"IF(E176=0,0,IMPRIMIR!A175)","v":0},{"$f":"IF(E176=0,0,IMPRIMIR!$D$3)","v":0},0,{"$f":"IMPRIMIR!B175","v":0},{"$f":"IMPRIMIR!C175","v":0},{"$f":"IF(E176=0,0,IMPRIMIR!D175)","v":0},{"$f":"IF(E176=0,0,IMPRIMIR!E175)","v":0},0,0,0]
[null,{"$f":"IF(E177=0,0,IMPRIMIR!A176)","v":0},{"$f":"IF(E177=0,0,IMPRIMIR!$D$3)","v":0},0,{"$f":"IMPRIMIR!B176","v":0},{"$f":"IMPRIMIR!C176","v":0},{"$f":"IF(E177=0,0,IMPRIMIR!D176)","v":0},{"$f":"IF(E177=0,0,IMPRIMIR!E176)","v":0},0,0,0]
[null,{"$f":"IF(E178=0,0,IMPRIMIR!A177)","v":0},{"$f":"IF(E178=0,0,IMPRIMIR!$D$3)","v":0},0,{"$f":"IMPRIMIR!B177","v":0},{"$f":"IMPRIMIR!C177","v":0},{"$f":"IF(E178=0,0,IMPRIMIR!D177)","v":0},{"$f":"IF(E178=0,0,IMPRIMIR!E177)","v":0},0,0,0]
[null,{"$f":"IF(E179=0,0,IMPRIMIR!A178)","v":0},{"$f":"IF(E179=0,0,IMPRIMIR!$D$3)","v":0},0,{"$f":"IMPRIMIR!B178","v":0},{"$f":"IMPRIMIR!C178","v":0},{"$f":"IF(E179=0,0,IMPRIMIR!D178)","v":0},{"$f":"IF(E179=0,0,IMPRIMIR!E178)","v":0},0,0,0]
[null,{"$f":"IF(E180=0,0,IMPRIMIR!A179)","v":0},{"$f":"IF(E180=0,0,IMPRIMIR!$D$3)","v":0},0,{"$f":"IMPRIMIR!B179","v":0},{"$f":"IMPRIMIR!C179","v":0},{"$f":"IF(E180=0,0,IMPRIMIR!D179)","v":0},{"$f":"IF(E180=0,0,IMPRIMIR!E179)","v":0},0,0,0]
[null,{"$f":"IF(E181=0,0,IMPRIMIR!A180)","v":0},{"$f":"IF(E181=0,0,IMPRIMIR!$D$3)","v":0},0,{"$f":"IMPRIMIR!B180","v":0},{"$f":"IMPRIMIR!C180","v":0},{"$f":"IF(E181=0,0,IMPRIMIR!D180)","v":0},{"$f":"IF(E181=0,0,IMPRIMIR!E180)","v":0},0,0,0]
[null,{"$f":"IF(E182=0,0,IMPRIMIR!A181)","v":0},{"$f":"IF(E182=0,0,IMPRIMIR!$D$3)","v":0},0,{"$f":"IMPRIMIR!B181","v":0},{"$f":"IMPRIMIR!C181","v":0},{"$f":"IF(E182=0,0,IMPRIMIR!D181)","v":0},{"$f":"IF(E182=0,0,IMPRIMIR!E181)","v":0},0,0,0]
[null,{"$f":"IF(E183=0,0,IMPRIMIR!A182)","v":0},{"$f":"IF(E183=0,0,IMPRIMIR!$D$3)","v":0},0,{"$f":"IMPRIMIR!B182","v":0},{"$f":"IMPRIMIR!C182","v":0},{"$f":"IF(E183=0,0,IMPRIMIR!D182)","v":0},{"$f":"IF(E183=0,0,IMPRIMIR!E182)","v":0},0,0,0]
[null,{"$f":"IF(E184=0,0,IMPRIMIR!A183)","v":0},{"$f":"IF(E184=0,0,IMPRIMIR!$D$3)","v":0},0,{"$f":"IMPRIMIR!B183","v":0},{"$f":"IMPRIMIR!C183","v":0},{"$f":"IF(E184=0,0,IMPRIMIR!D183)","v":0},{"$f":"IF(E184=0,0,IMPRIMIR!E183)","v":0},0,0,0]
[null,{"$f":"IF(E185=0,0,IMPRIMIR!A184)","v":0},{"$f":"IF(E185=0,0,IMPRIMIR!$D$3)","v":0},0,{"$f":"IMPRIMIR!B184","v":0},{"$f":"IMPRIMIR!C184","v":0},{"$f":"IF(E185=0,0,IMPRIMIR!D184)","v":0},{"$f":"IF(E185=0,0,IMPRIMIR!E184)","v":0},0,0,0]
[null,{"$f":"IF(E186=0,0,IMPRIMIR!A185)","v":0},{"$f":"IF(E186=0,0,IMPRIMIR!$D$3)","v":0},{"$f":"IF(E186=\"0\",0,$G$2)","v":0},{"$f":"IMPRIMIR!B185","v":0},{"$f":"IMPRIMIR!C185","v":0},{"$f":"IF(E186=0,0,IMPRIMIR!D185)","v":0},{"$f":"IF(E186=0,0,IMPRIMIR!E185)","v":0},{"$f":"IF(E186=0,0,$G$2)","v":0},{"$f":"IF(E186=0,0,$G$4)","v":0},{"$f":"IF(E186=0,0,$G$3)","v":0}]
[null,{"$f":"IF(E187=0,0,IMPRIMIR!A186)","v":0},{"$f":"IF(E187=0,0,IMPRIMIR!$D$3)","v":0},0,{"$f":"IMPRIMIR!B186","v":0},{"$f":"IMPRIMIR!C186","v":0},{"$f":"IF(E187=0,0,IMPRIMIR!D186)","v":0},{"$f":"IF(E187=0,0,IMPRIMIR!E186)","v":0},0,0,0]
[null,{"$f":"IF(E188=0,0,IMPRIMIR!A187)","v":0},{"$f":"IF(E188=0,0,IMPRIMIR!$D$3)","v":0},0,{"$f":"IMPRIMIR!B187","v":0},{"$f":"IMPRIMIR!C187","v":0},{"$f":"IF(E188=0,0,IMPRIMIR!D187)","v":0},{"$f":"IF(E188=0,0,IMPRIMIR!E187)","v":0},0,0,0]
[null,{"$f":"IF(E189=0,0,IMPRIMIR!A188)","v":0},{"$f":"IF(E189=0,0,IMPRIMIR!$D$3)","v":0},0,{"$f":"IMPRIMIR!B188","v":0},{"$f":"IMPRIMIR!C188","v":0},{"$f":"IF(E189=0,0,IMPRIMIR!D188)","v":0},{"$f":"IF(E189=0,0,IMPRIMIR!E188)","v":0},0,0,0]
[null,{"$f":"IF(E190=0,0,IMPRIMIR!A189)","v":0},{"$f":"IF(E190=0,0,IMPRIMIR!$D$3)","v":0},0,{"$f":"IMPRIMIR!B189","v":0},{"$f":"IMPRIMIR!C189","v":0},{"$f":"IF(E190=0,0,IMPRIMIR!D189)","v":0},{"$f":"IF(E190=0,0,IMPRIMIR!E189)","v":0},0,0,0]
[null,{"$f":"IF(E191=0,0,IMPRIMIR!A190)","v":0},{"$f":"IF(E191=0,0,IMPRIMIR!$D$3)","v":0},0,{"$f":"IMPRIMIR!B190","v":0},{"$f":"IMPRIMIR!C190","v":0},{"$f":"IF(E191=0,0,IMPRIMIR!D190)","v":0},{"$f":"IF(E191=0,0,IMPRIMIR!E190)","v":0},0,0,0]
[null,{"$f":"IF(E192=0,0,IMPRIMIR!A191)","v":0},{"$f":"IF(E192=0,0,IMPRIMIR!$D$3)","v":0},0,{"$f":"IMPRIMIR!B191","v":0},{"$f":"IMPRIMIR!C191","v":0},{"$f":"IF(E192=0,0,IMPRIMIR!D191)","v":0},{"$f":"IF(E192=0,0,IMPRIMIR!E191)","v":0},0,0,0]
[null,{"$f":"IF(E193=0,0,IMPRIMIR!A192)","v":0},{"$f":"IF(E193=0,0,IMPRIMIR!$D$3)","v":0},0,{"$f":"IMPRIMIR!B192","v":0},{"$f":"IMPRIMIR!C192","v":0},{"$f":"IF(E193=0,0,IMPRIMIR!D192)","v":0},{"$f":"IF(E193=0,0,IMPRIMIR!E192)","v":0},0,0,0]
[null,{"$f":"IF(E194=0,0,IMPRIMIR!A193)","v":0},{"$f":"IF(E194=0,0,IMPRIMIR!$D$3)","v":0},0,{"$f":"IMPRIMIR!B193","v":0},{"$f":"IMPRIMIR!C193","v":0},{"$f":"IF(E194=0,0,IMPRIMIR!D193)","v":0},{"$f":"IF(E194=0,0,IMPRIMIR!E193)","v":0},0,0,0]
[null,{"$f":"IF(E195=0,0,IMPRIMIR!A194)","v":0},{"$f":"IF(E195=0,0,IMPRIMIR!$D$3)","v":0},0,{"$f":"IMPRIMIR!B194","v":0},{"$f":"IMPRIMIR!C194","v":0},{"$f":"IF(E195=0,0,IMPRIMIR!D194)","v":0},{"$f":"IF(E195=0,0,IMPRIMIR!E194)","v":0},0,0,0]
[null,{"$f":"IF(E196=0,0,IMPRIMIR!A195)","v":0},{"$f":"IF(E196=0,0,IMPRIMIR!$D$3)","v":0},0,{"$f":"IMPRIMIR!B195","v":0},{"$f":"IMPRIMIR!C195","v":0},{"$f":"IF(E196=0,0,IMPRIMIR!D195)","v":0},{"$f":"IF(E196=0,0,IMPRIMIR!E195)","v":0},0,0,0]
[null,{"$f":"IF(E197=0,0,IMPRIMIR!A196)","v":0},{"$f":"IF(E197=0,0,IMPRIMIR!$D$3)","v":0},0,{"$f":"IMPRIMIR!B196","v":0},{"$f":"IMPRIMIR!C196","v":0},{"$f":"IF(E197=0,0,IMPRIMIR!D196)","v":0},{"$f":"IF(E197=0,0,IMPRIMIR!E196)","v":0},0,0,0]
[null,{"$f":"IF(E198=0,0,IMPRIMIR!A197)","v":0},{"$f":"IF(E198=0,0,IMPRIMIR!$D$3)","v":0},0,{"$f":"IMPRIMIR!B197","v":0},{"$f":"IMPRIMIR!C197","v":0},{"$f":"IF(E198=0,0,IMPRIMIR!D197)","v":0},{"$f":"IF(E198=0,0,IMPRIMIR!E197)","v":0},0,0,0]
[null,{"$f":"IF(E199=0,0,IMPRIMIR!A198)","v":0},{"$f":"IF(E199=0,0,IMPRIMIR!$D$3)","v":0},0,{"$f":"IMPRIMIR!B198","v":0},{"$f":"IMPRIMIR!C198","v":0},{"$f":"IF(E199=0,0,IMPRIMIR!D198)","v":0},{"$f":"IF(E199=0,0,IMPRIMIR!E198)","v":0},0,0,0]
[null,{"$f":"IF(E200=0,0,IMPRIMIR!A199)","v":0},{"$f":"IF(E200=0,0,IMPRIMIR!$D$3)","v":0},0,{"$f":"IMPRIMIR!B199","v":0},{"$f":"IMPRIMIR!C199","v":0},{"$f":"IF(E200=0,0,IMPRIMIR!D199)","v":0},{"$f":"IF(E200=0,0,IMPRIMIR!E199)","v":0},0,0,0]
[null,{"$f":"IF(E201=0,0,IMPRIMIR!A200)","v":0},{"$f":"IF(E201=0,0,IMPRIMIR!$D$3)","v":0},0,{"$f":"IMPRIMIR!B200","v":0},{"$f":"IMPRIMIR!C200","v":0},{"$f":"IF(E201=0,0,IMPRIMIR!D200)","v":0},{"$f":"IF(E201=0,0,IMPRIMIR!E200)","v":0},0,0,0]
[null,{"$f":"IF(E202=0,0,IMPRIMIR!A201)","v":0},{"$f":"IF(E202=0,0,IMPRIMIR!$D$3)","v":0},0,{"$f":"IMPRIMIR!B201","v":0},{"$f":"IMPRIMIR!C201","v":0},{"$f":"IF(E202=0,0,IMPRIMIR!D201)","v":0},{"$f":"IF(E202=0,0,IMPRIMIR!E201)","v":0},0,0,0]
[null,{"$f":"IF(E203=0,0,IMPRIMIR!A202)","v":0},{"$f":"IF(E203=0,0,IMPRIMIR!$D$3)","v":0},0,{"$f":"IMPRIMIR!B202","v":0},{"$f":"IMPRIMIR!C202","v":0},{"$f":"IF(E203=0,0,IMPRIMIR!D202)","v":0},{"$f":"IF(E203=0,0,IMPRIMIR!E202)","v":0},0,0,0]
[null,{"$f":"IF(E204=0,0,IMPRIMIR!A203)","v":0},{"$f":"IF(E204=0,0,IMPRIMIR!$D$3)","v":0},0,{"$f":"IMPRIMIR!B203","v":0},{"$f":"IMPRIMIR!C203","v":0},{"$f":"IF(E204=0,0,IMPRIMIR!D203)","v":0},{"$f":"IF(E204=0,0,IMPRIMIR!E203)","v":0},0,0,0]
[null,{"$f":"IF(E205=0,0,IMPRIMIR!A204)","v":0},{"$f":"IF(E205=0,0,IMPRIMIR!$D$3)","v":0},0,{"$f":"IMPRIMIR!B204","v":0},{"$f":"IMPRIMIR!C204","v":0},{"$f":"IF(E205=0,0,IMPRIMIR!D204)","v":0},{"$f":"IF(E205=0,0,IMPRIMIR!E204)","v":0},0,0,0]
[null,{"$f":"IF(E206=0,0,IMPRIMIR!A205)","v":0},{"$f":"IF(E206=0,0,IMPRIMIR!$D$3)","v":0},0,{"$f":"IMPRIMIR!B205","v":0},{"$f":"IMPRIMIR!C205","v":0},{"$f":"IF(E206=0,0,IMPRIMIR!D205)","v":0},{"$f":"IF(E206=0,0,IMPRIMIR!E205)","v":0},0,0,0]
[null,{"$f":"IF(E207=0,0,IMPRIMIR!A206)","v":0},{"$f":"IF(E207=0,0,IMPRIMIR!$D$3)","v":0},0,{"$f":"IMPRIMIR!B206","v":0},{"$f":"IMPRIMIR!C206","v":0},{"$f":"IF(E207=0,0,IMPRIMIR!D206)","v":0},{"$f":"IF(E207=0,0,IMPRIMIR!E206)","v":0},0,0,0]
[null,{"$f":"IF(E208=0,0,IMPRIMIR!A207)","v":0},{"$f":"IF(E208=0,0,IMPRIMIR!$D$3)","v":0},0,{"$f":"IMPRIMIR!B207","v":0},{"$f":"IMPRIMIR!C207","v":0},{"$f":"IF(E208=0,0,IMPRIMIR!D207)","v":0},{"$f":"IF(E208=0,0,IMPRIMIR!E207)","v":0},0,0,0]
[null,{"$f":"IF(E209=0,0,IMPRIMIR!A208)","v":0},{"$f":"IF(E209=0,0,IMPRIMIR!$D$3)","v":0},0,{"$f":"IMPRIMIR!B208","v":0},{"$f":"IMPRIMIR!C208","v":0},{"$f":"IF(E209=0,0,IMPRIMIR!D208)","v":0},{"$f":"IF(E209=0,0,IMPRIMIR!E208)","v":0},0,0,0]
[null,{"$f":"IF(E210=0,0,IMPRIMIR!A209)","v":0},{"$f":"IF(E210=0,0,IMPRIMIR!$D$3)","v":0},0,{"$f":"IMPRIMIR!B209","v":0},{"$f":"IMPRIMIR!C209","v":0},{"$f":"IF(E210=0,0,IMPRIMIR!D209)","v":0},{"$f":"IF(E210=0,0,IMPRIMIR!E209)","v":0},0,0,0]
[null,{"$f":"IF(E211=0,0,IMPRIMIR!A210)","v":0},{"$f":"IF(E211=0,0,IMPRIMIR!$D$3)","v":0},0,{"$f":"IMPRIMIR!B210","v":0},{"$f":"IMPRIMIR!C210","v":0},{"$f":"IF(E211=0,0,IMPRIMIR!D210)","v":0},{"$f":"IF(E211=0,0,IMPRIMIR!E210)","v":0},0,0,0]
[null,{"$f":"IF(E212=0,0,IMPRIMIR!A211)","v":0},{"$f":"IF(E212=0,0,IMPRIMIR!$D$3)","v":0},0,{"$f":"IMPRIMIR!B211","v":0},{"$f":"IMPRIMIR!C211","v":0},{"$f":"IF(E212=0,0,IMPRIMIR!D211)","v":0},{"$f":"IF(E212=0,0,IMPRIMIR!E211)","v":0},0,0,0]
[null,{"$f":"IF(E213=0,0,IMPRIMIR!A212)","v":0},{"$f":"IF(E213=0,0,IMPRIMIR!$D$3)","v":0},0,{"$f":"IMPRIMIR!B212","v":0},{"$f":"IMPRIMIR!C212","v":0},{"$f":"IF(E213=0,0,IMPRIMIR!D212)","v":0},{"$f":"IF(E213=0,0,IMPRIMIR!E212)","v":0},0,0,0]
[null,{"$f":"IF(E214=0,0,IMPRIMIR!A213)","v":0},{"$f":"IF(E214=0,0,IMPRIMIR!$D$3)","v":0},0,{"$f":"IMPRIMIR!B213","v":0},{"$f":"IMPRIMIR!C213","v":0},{"$f":"IF(E214=0,0,IMPRIMIR!D213)","v":0},{"$f":"IF(E214=0,0,IMPRIMIR!E213)","v":0},0,0,0]
[null,{"$f":"IF(E215=0,0,IMPRIMIR!A214)","v":0},{"$f":"IF(E215=0,0,IMPRIMIR!$D$3)","v":0},0,{"$f":"IMPRIMIR!B214","v":0},{"$f":"IMPRIMIR!C214","v":0},{"$f":"IF(E215=0,0,IMPRIMIR!D214)","v":0},{"$f":"IF(E215=0,0,IMPRIMIR!E214)","v":0},0,0,0]
[null,{"$f":"IF(E216=0,0,IMPRIMIR!A215)","v":0},{"$f":"IF(E216=0,0,IMPRIMIR!$D$3)","v":0},0,{"$f":"IMPRIMIR!B215","v":0},{"$f":"IMPRIMIR!C215","v":0},{"$f":"IF(E216=0,0,IMPRIMIR!D215)","v":0},{"$f":"IF(E216=0,0,IMPRIMIR!E215)","v":0},0,0,0]
[null,{"$f":"IF(E217=0,0,IMPRIMIR!A216)","v":0},{"$f":"IF(E217=0,0,IMPRIMIR!$D$3)","v":0},0,{"$f":"IMPRIMIR!B216","v":0},{"$f":"IMPRIMIR!C216","v":0},{"$f":"IF(E217=0,0,IMPRIMIR!D216)","v":0},{"$f":"IF(E217=0,0,IMPRIMIR!E216)","v":0},0,0,0]
[null,{"$f":"IF(E218=0,0,IMPRIMIR!A217)","v":0},{"$f":"IF(E218=0,0,IMPRIMIR!$D$3)","v":0},0,{"$f":"IMPRIMIR!B217","v":0},{"$f":"IMPRIMIR!C217","v":0},{"$f":"IF(E218=0,0,IMPRIMIR!D217)","v":0},{"$f":"IF(E218=0,0,IMPRIMIR!E217)","v":0},0,0,0]
[null,{"$f":"IF(E219=0,0,IMPRIMIR!A218)","v":0},{"$f":"IF(E219=0,0,IMPRIMIR!$D$3)","v":0},0,{"$f":"IMPRIMIR!B218","v":0},{"$f":"IMPRIMIR!C218","v":0},{"$f":"IF(E219=0,0,IMPRIMIR!D218)","v":0},{"$f":"IF(E219=0,0,IMPRIMIR!E218)","v":0},0,0,0]
[null,{"$f":"IF(E220=0,0,IMPRIMIR!A219)","v":0},{"$f":"IF(E220=0,0,IMPRIMIR!$D$3)","v":0},0,{"$f":"IMPRIMIR!B219","v":0},{"$f":"IMPRIMIR!C219","v":0},{"$f":"IF(E220=0,0,IMPRIMIR!D219)","v":0},{"$f":"IF(E220=0,0,IMPRIMIR!E219)","v":0},0,0,0]
[null,{"$f":"IF(E221=0,0,IMPRIMIR!A220)","v":0},{"$f":"IF(E221=0,0,IMPRIMIR!$D$3)","v":0},0,{"$f":"IMPRIMIR!B220","v":0},{"$f":"IMPRIMIR!C220","v":0},{"$f":"IF(E221=0,0,IMPRIMIR!D220)","v":0},{"$f":"IF(E221=0,0,IMPRIMIR!E220)","v":0},0,0,0]
[null,{"$f":"IF(E222=0,0,IMPRIMIR!A221)","v":0},{"$f":"IF(E222=0,0,IMPRIMIR!$D$3)","v":0},0,{"$f":"IMPRIMIR!B221","v":0},{"$f":"IMPRIMIR!C221","v":0},{"$f":"IF(E222=0,0,IMPRIMIR!D221)","v":0},{"$f":"IF(E222=0,0,IMPRIMIR!E221)","v":0},0,0,0]
[null,{"$f":"IF(E223=0,0,IMPRIMIR!A222)","v":0},{"$f":"IF(E223=0,0,IMPRIMIR!$D$3)","v":0},0,{"$f":"IMPRIMIR!B222","v":0},{"$f":"IMPRIMIR!C222","v":0},{"$f":"IF(E223=0,0,IMPRIMIR!D222)","v":0},{"$f":"IF(E223=0,0,IMPRIMIR!E222)","v":0},0,0,0]
[null,{"$f":"IF(E224=0,0,IMPRIMIR!A223)","v":0},{"$f":"IF(E224=0,0,IMPRIMIR!$D$3)","v":0},0,{"$f":"IMPRIMIR!B223","v":0},{"$f":"IMPRIMIR!C223","v":0},{"$f":"IF(E224=0,0,IMPRIMIR!D223)","v":0},{"$f":"IF(E224=0,0,IMPRIMIR!E223)","v":0},0,0,0]
[null,{"$f":"IF(E225=0,0,IMPRIMIR!A224)","v":0},{"$f":"IF(E225=0,0,IMPRIMIR!$D$3)","v":0},0,{"$f":"IMPRIMIR!B224","v":0},{"$f":"IMPRIMIR!C224","v":0},{"$f":"IF(E225=0,0,IMPRIMIR!D224)","v":0},{"$f":"IF(E225=0,0,IMPRIMIR!E224)","v":0},0,0,0]
[null,{"$f":"IF(E226=0,0,IMPRIMIR!A225)","v":0},{"$f":"IF(E226=0,0,IMPRIMIR!$D$3)","v":0},0,{"$f":"IMPRIMIR!B225","v":0},{"$f":"IMPRIMIR!C225","v":0},{"$f":"IF(E226=0,0,IMPRIMIR!D225)","v":0},{"$f":"IF(E226=0,0,IMPRIMIR!E225)","v":0},0,0,0]
[null,{"$f":"IF(E227=0,0,IMPRIMIR!A226)","v":0},{"$f":"IF(E227=0,0,IMPRIMIR!$D$3)","v":0},0,{"$f":"IMPRIMIR!B226","v":0},{"$f":"IMPRIMIR!C226","v":0},{"$f":"IF(E227=0,0,IMPRIMIR!D226)","v":0},{"$f":"IF(E227=0,0,IMPRIMIR!E226)","v":0},0,0,0]
[null,{"$f":"IF(E228=0,0,IMPRIMIR!A227)","v":0},{"$f":"IF(E228=0,0,IMPRIMIR!$D$3)","v":0},0,{"$f":"IMPRIMIR!B227","v":0},{"$f":"IMPRIMIR!C227","v":0},{"$f":"IF(E228=0,0,IMPRIMIR!D227)","v":0},{"$f":"IF(E228=0,0,IMPRIMIR!E227)","v":0},0,0,0]
[null,{"$f":"IF(E229=0,0,IMPRIMIR!A228)","v":0},{"$f":"IF(E229=0,0,IMPRIMIR!$D$3)","v":0},0,{"$f":"IMPRIMIR!B228","v":0},{"$f":"IMPRIMIR!C228","v":0},{"$f":"IF(E229=0,0,IMPRIMIR!D228)","v":0},{"$f":"IF(E229=0,0,IMPRIMIR!E228)","v":0},0,0,0]
[null,{"$f":"IF(E230=0,0,IMPRIMIR!A229)","v":0},{"$f":"IF(E230=0,0,IMPRIMIR!$D$3)","v":0},0,{"$f":"IMPRIMIR!B229","v":0},{"$f":"IMPRIMIR!C229","v":0},{"$f":"IF(E230=0,0,IMPRIMIR!D229)","v":0},{"$f":"IF(E230=0,0,IMPRIMIR!E229)","v":0},0,0,0]
[null,{"$f":"IF(E231=0,0,IMPRIMIR!A230)","v":0},{"$f":"IF(E231=0,0,IMPRIMIR!$D$3)","v":0},0,{"$f":"IMPRIMIR!B230","v":0},{"$f":"IMPRIMIR!C230","v":0},{"$f":"IF(E231=0,0,IMPRIMIR!D230)","v":0},{"$f":"IF(E231=0,0,IMPRIMIR!E230)","v":0},0,0,0]
[null,{"$f":"IF(E232=0,0,IMPRIMIR!A231)","v":0},{"$f":"IF(E232=0,0,IMPRIMIR!$D$3)","v":0},0,{"$f":"IMPRIMIR!B231","v":0},{"$f":"IMPRIMIR!C231","v":0},{"$f":"IF(E232=0,0,IMPRIMIR!D231)","v":0},{"$f":"IF(E232=0,0,IMPRIMIR!E231)","v":0},0,0,0]
[null,{"$f":"IF(E233=0,0,IMPRIMIR!A232)","v":0},{"$f":"IF(E233=0,0,IMPRIMIR!$D$3)","v":0},0,{"$f":"IMPRIMIR!B232","v":0},{"$f":"IMPRIMIR!C232","v":0},{"$f":"IF(E233=0,0,IMPRIMIR!D232)","v":0},{"$f":"IF(E233=0,0,IMPRIMIR!E232)","v":0},0,0,0]
[null,{"$f":"IF(E234=0,0,IMPRIMIR!A233)","v":0},{"$f":"IF(E234=0,0,IMPRIMIR!$D$3)","v":0},0,{"$f":"IMPRIMIR!B233","v":0},{"$f":"IMPRIMIR!C233","v":0},{"$f":"IF(E234=0,0,IMPRIMIR!D233)","v":0},{"$f":"IF(E234=0,0,IMPRIMIR!E233)","v":0},0,0,0]
[null,{"$f":"IF(E235=0,0,IMPRIMIR!A234)","v":0},{"$f":"IF(E235=0,0,IMPRIMIR!$D$3)","v":0},{"$f":"IF(E235=\"0\",0,$G$2)","v":0},{"$f":"IMPRIMIR!B234","v":0},{"$f":"IMPRIMIR!C234","v":0},{"$f":"IF(E235=0,0,IMPRIMIR!D234)","v":0},{"$f":"IF(E235=0,0,IMPRIMIR!E234)","v":0},{"$f":"IF(E235=0,0,$G$2)","v":0},{"$f":"IF(E235=0,0,$G$4)","v":0},{"$f":"IF(E235=0,0,$G$3)","v":0}]
[null,{"$f":"IF(E236=0,0,IMPRIMIR!A235)","v":0},{"$f":"IF(E236=0,0,IMPRIMIR!$D$3)","v":0},0,{"$f":"IMPRIMIR!B235","v":0},{"$f":"IMPRIMIR!C235","v":0},{"$f":"IF(E236=0,0,IMPRIMIR!D235)","v":0},{"$f":"IF(E236=0,0,IMPRIMIR!E235)","v":0},0,0,0]
[null,{"$f":"IF(E237=0,0,IMPRIMIR!A236)","v":0},{"$f":"IF(E237=0,0,IMPRIMIR!$D$3)","v":0},0,{"$f":"IMPRIMIR!B236","v":0},{"$f":"IMPRIMIR!C236","v":0},{"$f":"IF(E237=0,0,IMPRIMIR!D236)","v":0},{"$f":"IF(E237=0,0,IMPRIMIR!E236)","v":0},0,0,0]
[null,{"$f":"IF(E238=0,0,IMPRIMIR!A237)","v":0},{"$f":"IF(E238=0,0,IMPRIMIR!$D$3)","v":0},0,{"$f":"IMPRIMIR!B237","v":0},{"$f":"IMPRIMIR!C237","v":0},{"$f":"IF(E238=0,0,IMPRIMIR!D237)","v":0},{"$f":"IF(E238=0,0,IMPRIMIR!E237)","v":0},0,0,0]
[null,{"$f":"IF(E239=0,0,IMPRIMIR!A238)","v":0},{"$f":"IF(E239=0,0,IMPRIMIR!$D$3)","v":0},0,{"$f":"IMPRIMIR!B238","v":0},{"$f":"IMPRIMIR!C238","v":0},{"$f":"IF(E239=0,0,IMPRIMIR!D238)","v":0},{"$f":"IF(E239=0,0,IMPRIMIR!E238)","v":0},0,0,0]
[null,{"$f":"IF(E240=0,0,IMPRIMIR!A239)","v":0},{"$f":"IF(E240=0,0,IMPRIMIR!$D$3)","v":0},0,{"$f":"IMPRIMIR!B239","v":0},{"$f":"IMPRIMIR!C239","v":0},{"$f":"IF(E240=0,0,IMPRIMIR!D239)","v":0},{"$f":"IF(E240=0,0,IMPRIMIR!E239)","v":0},0,0,0]
[null,{"$f":"IF(E241=0,0,IMPRIMIR!A240)","v":0},{"$f":"IF(E241=0,0,IMPRIMIR!$D$3)","v":0},0,{"$f":"IMPRIMIR!B240","v":0},{"$f":"IMPRIMIR!C240","v":0},{"$f":"IF(E241=0,0,IMPRIMIR!D240)","v":0},{"$f":"IF(E241=0,0,IMPRIMIR!E240)","v":0},0,0,0]
[null,{"$f":"IF(E242=0,0,IMPRIMIR!A241)","v":0},{"$f":"IF(E242=0,0,IMPRIMIR!$D$3)","v":0},0,{"$f":"IMPRIMIR!B241","v":0},{"$f":"IMPRIMIR!C241","v":0},{"$f":"IF(E242=0,0,IMPRIMIR!D241)","v":0},{"$f":"IF(E242=0,0,IMPRIMIR!E241)","v":0},0,0,0]
[null,{"$f":"IF(E243=0,0,IMPRIMIR!A242)","v":0},{"$f":"IF(E243=0,0,IMPRIMIR!$D$3)","v":0},0,{"$f":"IMPRIMIR!B242","v":0},{"$f":"IMPRIMIR!C242","v":0},{"$f":"IF(E243=0,0,IMPRIMIR!D242)","v":0},{"$f":"IF(E243=0,0,IMPRIMIR!E242)","v":0},0,0,0]
[null,{"$f":"IF(E244=0,0,IMPRIMIR!A243)","v":0},{"$f":"IF(E244=0,0,IMPRIMIR!$D$3)","v":0},0,{"$f":"IMPRIMIR!B243","v":0},{"$f":"IMPRIMIR!C243","v":0},{"$f":"IF(E244=0,0,IMPRIMIR!D243)","v":0},{"$f":"IF(E244=0,0,IMPRIMIR!E243)","v":0},0,0,0]
[null,{"$f":"IF(E245=0,0,IMPRIMIR!A244)","v":0},{"$f":"IF(E245=0,0,IMPRIMIR!$D$3)","v":0},0,{"$f":"IMPRIMIR!B244","v":0},{"$f":"IMPRIMIR!C244","v":0},{"$f":"IF(E245=0,0,IMPRIMIR!D244)","v":0},{"$f":"IF(E245=0,0,IMPRIMIR!E244)","v":0},0,0,0]
[null,{"$f":"IF(E246=0,0,IMPRIMIR!A245)","v":0},{"$f":"IF(E246=0,0,IMPRIMIR!$D$3)","v":0},0,{"$f":"IMPRIMIR!B245","v":0},{"$f":"IMPRIMIR!C245","v":0},{"$f":"IF(E246=0,0,IMPRIMIR!D245)","v":0},{"$f":"IF(E246=0,0,IMPRIMIR!E245)","v":0},0,0,0]
[null,{"$f":"IF(E247=0,0,IMPRIMIR!A246)","v":0},{"$f":"IF(E247=0,0,IMPRIMIR!$D$3)","v":0},0,{"$f":"IMPRIMIR!B246","v":0},{"$f":"IMPRIMIR!C246","v":0},{"$f":"IF(E247=0,0,IMPRIMIR!D246)","v":0},{"$f":"IF(E247=0,0,IMPRIMIR!E246)","v":0},0,0,0]
[null,{"$f":"IF(E248=0,0,IMPRIMIR!A247)","v":0},{"$f":"IF(E248=0,0,IMPRIMIR!$D$3)","v":0},0,{"$f":"IMPRIMIR!B247","v":0},{"$f":"IMPRIMIR!C247","v":0},{"$f":"IF(E248=0,0,IMPRIMIR!D247)","v":0},{"$f":"IF(E248=0,0,IMPRIMIR!E247)","v":0},0,0,0]
[null,{"$f":"IF(E249=0,0,IMPRIMIR!A248)","v":0},{"$f":"IF(E249=0,0,IMPRIMIR!$D$3)","v":0},0,{"$f":"IMPRIMIR!B248","v":0},{"$f":"IMPRIMIR!C248","v":0},{"$f":"IF(E249=0,0,IMPRIMIR!D248)","v":0},{"$f":"IF(E249=0,0,IMPRIMIR!E248)","v":0},0,0,0]
[null,{"$f":"IF(E250=0,0,IMPRIMIR!A249)","v":0},{"$f":"IF(E250=0,0,IMPRIMIR!$D$3)","v":0},0,{"$f":"IMPRIMIR!B249","v":0},{"$f":"IMPRIMIR!C249","v":0},{"$f":"IF(E250=0,0,IMPRIMIR!D249)","v":0},{"$f":"IF(E250=0,0,IMPRIMIR!E249)","v":0},0,0,0]
[null,{"$f":"IF(E251=0,0,IMPRIMIR!A250)","v":0},{"$f":"IF(E251=0,0,IMPRIMIR!$D$3)","v":0},0,{"$f":"IMPRIMIR!B250","v":0},{"$f":"IMPRIMIR!C250","v":0},{"$f":"IF(E251=0,0,IMPRIMIR!D250)","v":0},{"$f":"IF(E251=0,0,IMPRIMIR!E250)","v":0},0,0,0]
[null,{"$f":"IF(E252=0,0,IMPRIMIR!A251)","v":0},{"$f":"IF(E252=0,0,IMPRIMIR!$D$3)","v":0},0,{"$f":"IMPRIMIR!B251","v":0},{"$f":"IMPRIMIR!C251","v":0},{"$f":"IF(E252=0,0,IMPRIMIR!D251)","v":0},{"$f":"IF(E252=0,0,IMPRIMIR!E251)","v":0},0,0,0]
[null,{"$f":"IF(E253=0,0,IMPRIMIR!A252)","v":0},{"$f":"IF(E253=0,0,IMPRIMIR!$D$3)","v":0},0,{"$f":"IMPRIMIR!B252","v":0},{"$f":"IMPRIMIR!C252","v":0},{"$f":"IF(E253=0,0,IMPRIMIR!D252)","v":0},{"$f":"IF(E253=0,0,IMPRIMIR!E252)","v":0},0,0,0]
[null,{"$f":"IF(E254=0,0,IMPRIMIR!A253)","v":0},{"$f":"IF(E254=0,0,IMPRIMIR!$D$3)","v":0},0,{"$f":"IMPRIMIR!B253","v":0},{"$f":"IMPRIMIR!C253","v":0},{"$f":"IF(E254=0,0,IMPRIMIR!D253)","v":0},{"$f":"IF(E254=0,0,IMPRIMIR!E253)","v":0},0,0,0]
[null,{"$f":"IF(E255=0,0,IMPRIMIR!A254)","v":0},{"$f":"IF(E255=0,0,IMPRIMIR!$D$3)","v":0},0,{"$f":"IMPRIMIR!B254","v":0},{"$f":"IMPRIMIR!C254","v":0},{"$f":"IF(E255=0,0,IMPRIMIR!D254)","v":0},{"$f":"IF(E255=0,0,IMPRIMIR!E254)","v":0},0,0,0]
[null,{"$f":"IF(E256=0,0,IMPRIMIR!A255)","v":0},{"$f":"IF(E256=0,0,IMPRIMIR!$D$3)","v":0},0,{"$f":"IMPRIMIR!B255","v":0},{"$f":"IMPRIMIR!C255","v":0},{"$f":"IF(E256=0,0,IMPRIMIR!D255)","v":0},{"$f":"IF(E256=0,0,IMPRIMIR!E255)","v":0},0,0,0]
[null,{"$f":"IF(E257=0,0,IMPRIMIR!A256)","v":0},{"$f":"IF(E257=0,0,IMPRIMIR!$D$3)","v":0},0,{"$f":"IMPRIMIR!B256","v":0},{"$f":"IMPRIMIR!C256","v":0},{"$f":"IF(E257=0,0,IMPRIMIR!D256)","v":0},{"$f":"IF(E257=0,0,IMPRIMIR!E256)","v":0},0,0,0]
[null,{"$f":"IF(E258=0,0,IMPRIMIR!A257)","v":0},{"$f":"IF(E258=0,0,IMPRIMIR!$D$3)","v":0},0,{"$f":"IMPRIMIR!B257","v":0},{"$f":"IMPRIMIR!C257","v":0},{"$f":"IF(E258=0,0,IMPRIMIR!D257)","v":0},{"$f":"IF(E258=0,0,IMPRIMIR!E257)","v":0},0,0,0]
[null,{"$f":"IF(E259=0,0,IMPRIMIR!A258)","v":0},{"$f":"IF(E259=0,0,IMPRIMIR!$D$3)","v":0},0,{"$f":"IMPRIMIR!B258","v":0},{"$f":"IMPRIMIR!C258","v":0},{"$f":"IF(E259=0,0,IMPRIMIR!D258)","v":0},{"$f":"IF(E259=0,0,IMPRIMIR!E258)","v":0},0,0,0]
[null,{"$f":"IF(E260=0,0,IMPRIMIR!A259)","v":0},{"$f":"IF(E260=0,0,IMPRIMIR!$D$3)","v":0},0,{"$f":"IMPRIMIR!B259","v":0},{"$f":"IMPRIMIR!C259","v":0},{"$f":"IF(E260=0,0,IMPRIMIR!D259)","v":0},{"$f":"IF(E260=0,0,IMPRIMIR!E259)","v":0},0,0,0]
[null,{"$f":"IF(E261=0,0,IMPRIMIR!A260)","v":0},{"$f":"IF(E261=0,0,IMPRIMIR!$D$3)","v":0},0,{"$f":"IMPRIMIR!B260","v":0},{"$f":"IMPRIMIR!C260","v":0},{"$f":"IF(E261=0,0,IMPRIMIR!D260)","v":0},{"$f":"IF(E261=0,0,IMPRIMIR!E260)","v":0},0,0,0]
[null,{"$f":"IF(E262=0,0,IMPRIMIR!A261)","v":0},{"$f":"IF(E262=0,0,IMPRIMIR!$D$3)","v":0},0,{"$f":"IMPRIMIR!B261","v":0},{"$f":"IMPRIMIR!C261","v":0},{"$f":"IF(E262=0,0,IMPRIMIR!D261)","v":0},{"$f":"IF(E262=0,0,IMPRIMIR!E261)","v":0},0,0,0]
[null,{"$f":"IF(E263=0,0,IMPRIMIR!A262)","v":0},{"$f":"IF(E263=0,0,IMPRIMIR!$D$3)","v":0},0,{"$f":"IMPRIMIR!B262","v":0},{"$f":"IMPRIMIR!C262","v":0},{"$f":"IF(E263=0,0,IMPRIMIR!D262)","v":0},{"$f":"IF(E263=0,0,IMPRIMIR!E262)","v":0},0,0,0]
[null,{"$f":"IF(E264=0,0,IMPRIMIR!A263)","v":0},{"$f":"IF(E264=0,0,IMPRIMIR!$D$3)","v":0},0,{"$f":"IMPRIMIR!B263","v":0},{"$f":"IMPRIMIR!C263","v":0},{"$f":"IF(E264=0,0,IMPRIMIR!D263)","v":0},{"$f":"IF(E264=0,0,IMPRIMIR!E263)","v":0},0,0,0]
[null,{"$f":"IF(E265=0,0,IMPRIMIR!A264)","v":0},{"$f":"IF(E265=0,0,IMPRIMIR!$D$3)","v":0},0,{"$f":"IMPRIMIR!B264","v":0},{"$f":"IMPRIMIR!C264","v":0},{"$f":"IF(E265=0,0,IMPRIMIR!D264)","v":0},{"$f":"IF(E265=0,0,IMPRIMIR!E264)","v":0},0,0,0]
[null,{"$f":"IF(E266=0,0,IMPRIMIR!A265)","v":0},{"$f":"IF(E266=0,0,IMPRIMIR!$D$3)","v":0},0,{"$f":"IMPRIMIR!B265","v":0},{"$f":"IMPRIMIR!C265","v":0},{"$f":"IF(E266=0,0,IMPRIMIR!D265)","v":0},{"$f":"IF(E266=0,0,IMPRIMIR!E265)","v":0},0,0,0]
[null,{"$f":"IF(E267=0,0,IMPRIMIR!A266)","v":0},{"$f":"IF(E267=0,0,IMPRIMIR!$D$3)","v":0},0,{"$f":"IMPRIMIR!B266","v":0},{"$f":"IMPRIMIR!C266","v":0},{"$f":"IF(E267=0,0,IMPRIMIR!D266)","v":0},{"$f":"IF(E267=0,0,IMPRIMIR!E266)","v":0},0,0,0]
[null,{"$f":"IF(E268=0,0,IMPRIMIR!A267)","v":0},{"$f":"IF(E268=0,0,IMPRIMIR!$D$3)","v":0},0,{"$f":"IMPRIMIR!B267","v":0},{"$f":"IMPRIMIR!C267","v":0},{"$f":"IF(E268=0,0,IMPRIMIR!D267)","v":0},{"$f":"IF(E268=0,0,IMPRIMIR!E267)","v":0},0,0,0]
[null,{"$f":"IF(E269=0,0,IMPRIMIR!A268)","v":0},{"$f":"IF(E269=0,0,IMPRIMIR!$D$3)","v":0},0,{"$f":"IMPRIMIR!B268","v":0},{"$f":"IMPRIMIR!C268","v":0},{"$f":"IF(E269=0,0,IMPRIMIR!D268)","v":0},{"$f":"IF(E269=0,0,IMPRIMIR!E268)","v":0},0,0,0]
[null,{"$f":"IF(E270=0,0,IMPRIMIR!A269)","v":0},{"$f":"IF(E270=0,0,IMPRIMIR!$D$3)","v":0},0,{"$f":"IMPRIMIR!B269","v":0},{"$f":"IMPRIMIR!C269","v":0},{"$f":"IF(E270=0,0,IMPRIMIR!D269)","v":0},{"$f":"IF(E270=0,0,IMPRIMIR!E269)","v":0},0,0,0]
[null,{"$f":"IF(E271=0,0,IMPRIMIR!A270)","v":0},{"$f":"IF(E271=0,0,IMPRIMIR!$D$3)","v":0},0,{"$f":"IMPRIMIR!B270","v":0},{"$f":"IMPRIMIR!C270","v":0},{"$f":"IF(E271=0,0,IMPRIMIR!D270)","v":0},{"$f":"IF(E271=0,0,IMPRIMIR!E270)","v":0},0,0,0]
[null,{"$f":"IF(E272=0,0,IMPRIMIR!A271)","v":0},{"$f":"IF(E272=0,0,IMPRIMIR!$D$3)","v":0},0,{"$f":"IMPRIMIR!B271","v":0},{"$f":"IMPRIMIR!C271","v":0},{"$f":"IF(E272=0,0,IMPRIMIR!D271)","v":0},{"$f":"IF(E272=0,0,IMPRIMIR!E271)","v":0},0,0,0]
[null,{"$f":"IF(E273=0,0,IMPRIMIR!A272)","v":0},{"$f":"IF(E273=0,0,IMPRIMIR!$D$3)","v":0},0,{"$f":"IMPRIMIR!B272","v":0},{"$f":"IMPRIMIR!C272","v":0},{"$f":"IF(E273=0,0,IMPRIMIR!D272)","v":0},{"$f":"IF(E273=0,0,IMPRIMIR!E272)","v":0},0,0,0]
[null,{"$f":"IF(E274=0,0,IMPRIMIR!A273)","v":0},{"$f":"IF(E274=0,0,IMPRIMIR!$D$3)","v":0},0,{"$f":"IMPRIMIR!B273","v":0},{"$f":"IMPRIMIR!C273","v":0},{"$f":"IF(E274=0,0,IMPRIMIR!D273)","v":0},{"$f":"IF(E274=0,0,IMPRIMIR!E273)","v":0},0,0,0]
[null,{"$f":"IF(E275=0,0,IMPRIMIR!A274)","v":0},{"$f":"IF(E275=0,0,IMPRIMIR!$D$3)","v":0},{"$f":"IF(E275=\"0\",0,$G$2)","v":0},{"$f":"IMPRIMIR!B274","v":0},{"$f":"IMPRIMIR!C274","v":0},{"$f":"IF(E275=0,0,IMPRIMIR!D274)","v":0},{"$f":"IF(E275=0,0,IMPRIMIR!E274)","v":0},{"$f":"IF(E275=0,0,$G$2)","v":0},{"$f":"IF(E275=0,0,$G$4)","v":0},{"$f":"IF(E275=0,0,$G$3)","v":0}]
[null,{"$f":"IF(E276=0,0,IMPRIMIR!A275)","v":0},{"$f":"IF(E276=0,0,IMPRIMIR!$D$3)","v":0},0,{"$f":"IMPRIMIR!B275","v":0},{"$f":"IMPRIMIR!C275","v":0},{"$f":"IF(E276=0,0,IMPRIMIR!D275)","v":0},{"$f":"IF(E276=0,0,IMPRIMIR!E275)","v":0},0,0,0]
[null,{"$f":"IF(E277=0,0,IMPRIMIR!A276)","v":0},{"$f":"IF(E277=0,0,IMPRIMIR!$D$3)","v":0},0,{"$f":"IMPRIMIR!B276","v":0},{"$f":"IMPRIMIR!C276","v":0},{"$f":"IF(E277=0,0,IMPRIMIR!D276)","v":0},{"$f":"IF(E277=0,0,IMPRIMIR!E276)","v":0},0,0,0]
[null,{"$f":"IF(E278=0,0,IMPRIMIR!A277)","v":0},{"$f":"IF(E278=0,0,IMPRIMIR!$D$3)","v":0},0,{"$f":"IMPRIMIR!B277","v":0},{"$f":"IMPRIMIR!C277","v":0},{"$f":"IF(E278=0,0,IMPRIMIR!D277)","v":0},{"$f":"IF(E278=0,0,IMPRIMIR!E277)","v":0},0,0,0]
[null,{"$f":"IF(E279=0,0,IMPRIMIR!A278)","v":0},{"$f":"IF(E279=0,0,IMPRIMIR!$D$3)","v":0},0,{"$f":"IMPRIMIR!B278","v":0},{"$f":"IMPRIMIR!C278","v":0},{"$f":"IF(E279=0,0,IMPRIMIR!D278)","v":0},{"$f":"IF(E279=0,0,IMPRIMIR!E278)","v":0},0,0,0]
[null,{"$f":"IF(E280=0,0,IMPRIMIR!A279)","v":0},{"$f":"IF(E280=0,0,IMPRIMIR!$D$3)","v":0},0,{"$f":"IMPRIMIR!B279","v":0},{"$f":"IMPRIMIR!C279","v":0},{"$f":"IF(E280=0,0,IMPRIMIR!D279)","v":0},{"$f":"IF(E280=0,0,IMPRIMIR!E279)","v":0},0,0,0]
[null,{"$f":"IF(E281=0,0,IMPRIMIR!A280)","v":0},{"$f":"IF(E281=0,0,IMPRIMIR!$D$3)","v":0},0,{"$f":"IMPRIMIR!B280","v":0},{"$f":"IMPRIMIR!C280","v":0},{"$f":"IF(E281=0,0,IMPRIMIR!D280)","v":0},{"$f":"IF(E281=0,0,IMPRIMIR!E280)","v":0},0,0,0]
[null,{"$f":"IF(E282=0,0,IMPRIMIR!A281)","v":0},{"$f":"IF(E282=0,0,IMPRIMIR!$D$3)","v":0},0,{"$f":"IMPRIMIR!B281","v":0},{"$f":"IMPRIMIR!C281","v":0},{"$f":"IF(E282=0,0,IMPRIMIR!D281)","v":0},{"$f":"IF(E282=0,0,IMPRIMIR!E281)","v":0},0,0,0]
[null,{"$f":"IF(E283=0,0,IMPRIMIR!A282)","v":0},{"$f":"IF(E283=0,0,IMPRIMIR!$D$3)","v":0},0,{"$f":"IMPRIMIR!B282","v":0},{"$f":"IMPRIMIR!C282","v":0},{"$f":"IF(E283=0,0,IMPRIMIR!D282)","v":0},{"$f":"IF(E283=0,0,IMPRIMIR!E282)","v":0},0,0,0]
[null,{"$f":"IF(E284=0,0,IMPRIMIR!A283)","v":0},{"$f":"IF(E284=0,0,IMPRIMIR!$D$3)","v":0},0,{"$f":"IMPRIMIR!B283","v":0},{"$f":"IMPRIMIR!C283","v":0},{"$f":"IF(E284=0,0,IMPRIMIR!D283)","v":0},{"$f":"IF(E284=0,0,IMPRIMIR!E283)","v":0},0,0,0]
[null,{"$f":"IF(E285=0,0,IMPRIMIR!A284)","v":0},{"$f":"IF(E285=0,0,IMPRIMIR!$D$3)","v":0},0,{"$f":"IMPRIMIR!B284","v":0},{"$f":"IMPRIMIR!C284","v":0},{"$f":"IF(E285=0,0,IMPRIMIR!D284)","v":0},{"$f":"IF(E285=0,0,IMPRIMIR!E284)","v":0},0,0,0]
[null,{"$f":"IF(E286=0,0,IMPRIMIR!A285)","v":0},{"$f":"IF(E286=0,0,IMPRIMIR!$D$3)","v":0},0,{"$f":"IMPRIMIR!B285","v":0},{"$f":"IMPRIMIR!C285","v":0},{"$f":"IF(E286=0,0,IMPRIMIR!D285)","v":0},{"$f":"IF(E286=0,0,IMPRIMIR!E285)","v":0},0,0,0]
[null,{"$f":"IF(E287=0,0,IMPRIMIR!A286)","v":0},{"$f":"IF(E287=0,0,IMPRIMIR!$D$3)","v":0},0,{"$f":"IMPRIMIR!B286","v":0},{"$f":"IMPRIMIR!C286","v":0},{"$f":"IF(E287=0,0,IMPRIMIR!D286)","v":0},{"$f":"IF(E287=0,0,IMPRIMIR!E286)","v":0},0,0,0]
[null,{"$f":"IF(E288=0,0,IMPRIMIR!A287)","v":0},{"$f":"IF(E288=0,0,IMPRIMIR!$D$3)","v":0},0,{"$f":"IMPRIMIR!B287","v":0},{"$f":"IMPRIMIR!C287","v":0},{"$f":"IF(E288=0,0,IMPRIMIR!D287)","v":0},{"$f":"IF(E288=0,0,IMPRIMIR!E287)","v":0},0,0,0]
[null,{"$f":"IF(E289=0,0,IMPRIMIR!A288)","v":0},{"$f":"IF(E289=0,0,IMPRIMIR!$D$3)","v":0},0,{"$f":"IMPRIMIR!B288","v":0},{"$f":"IMPRIMIR!C288","v":0},{"$f":"IF(E289=0,0,IMPRIMIR!D288)","v":0},{"$f":"IF(E289=0,0,IMPRIMIR!E288)","v":0},0,0,0]
[null,{"$f":"IF(E290=0,0,IMPRIMIR!A289)","v":0},{"$f":"IF(E290=0,0,IMPRIMIR!$D$3)","v":0},0,{"$f":"IMPRIMIR!B289","v":0},{"$f":"IMPRIMIR!C289","v":0},{"$f":"IF(E290=0,0,IMPRIMIR!D289)","v":0},{"$f":"IF(E290=0,0,IMPRIMIR!E289)","v":0},0,0,0]
[null,{"$f":"IF(E291=0,0,IMPRIMIR!A290)","v":0},{"$f":"IF(E291=0,0,IMPRIMIR!$D$3)","v":0},0,{"$f":"IMPRIMIR!B290","v":0},{"$f":"IMPRIMIR!C290","v":0},{"$f":"IF(E291=0,0,IMPRIMIR!D290)","v":0},{"$f":"IF(E291=0,0,IMPRIMIR!E290)","v":0},0,0,0]
[null,{"$f":"IF(E292=0,0,IMPRIMIR!A291)","v":0},{"$f":"IF(E292=0,0,IMPRIMIR!$D$3)","v":0},0,{"$f":"IMPRIMIR!B291","v":0},{"$f":"IMPRIMIR!C291","v":0},{"$f":"IF(E292=0,0,IMPRIMIR!D291)","v":0},{"$f":"IF(E292=0,0,IMPRIMIR!E291)","v":0},0,0,0]
[null,{"$f":"IF(E293=0,0,IMPRIMIR!A292)","v":0},{"$f":"IF(E293=0,0,IMPRIMIR!$D$3)","v":0},0,{"$f":"IMPRIMIR!B292","v":0},{"$f":"IMPRIMIR!C292","v":0},{"$f":"IF(E293=0,0,IMPRIMIR!D292)","v":0},{"$f":"IF(E293=0,0,IMPRIMIR!E292)","v":0},0,0,0]
[null,{"$f":"IF(E294=0,0,IMPRIMIR!A293)","v":0},{"$f":"IF(E294=0,0,IMPRIMIR!$D$3)","v":0},0,{"$f":"IMPRIMIR!B293","v":0},{"$f":"IMPRIMIR!C293","v":0},{"$f":"IF(E294=0,0,IMPRIMIR!D293)","v":0},{"$f":"IF(E294=0,0,IMPRIMIR!E293)","v":0},0,0,0]
[null,{"$f":"IF(E295=0,0,IMPRIMIR!A294)","v":0},{"$f":"IF(E295=0,0,IMPRIMIR!$D$3)","v":0},0,{"$f":"IMPRIMIR!B294","v":0},{"$f":"IMPRIMIR!C294","v":0},{"$f":"IF(E295=0,0,IMPRIMIR!D294)","v":0},{"$f":"IF(E295=0,0,IMPRIMIR!E294)","v":0},0,0,0]
[null,{"$f":"IF(E296=0,0,IMPRIMIR!A295)","v":0},{"$f":"IF(E296=0,0,IMPRIMIR!$D$3)","v":0},0,{"$f":"IMPRIMIR!B295","v":0},{"$f":"IMPRIMIR!C295","v":0},{"$f":"IF(E296=0,0,IMPRIMIR!D295)","v":0},{"$f":"IF(E296=0,0,IMPRIMIR!E295)","v":0},0,0,0]
[null,{"$f":"IF(E297=0,0,IMPRIMIR!A296)","v":0},{"$f":"IF(E297=0,0,IMPRIMIR!$D$3)","v":0},0,{"$f":"IMPRIMIR!B296","v":0},{"$f":"IMPRIMIR!C296","v":0},{"$f":"IF(E297=0,0,IMPRIMIR!D296)","v":0},{"$f":"IF(E297=0,0,IMPRIMIR!E296)","v":0},0,0,0]
[null,{"$f":"IF(E298=0,0,IMPRIMIR!A297)","v":0},{"$f":"IF(E298=0,0,IMPRIMIR!$D$3)","v":0},0,{"$f":"IMPRIMIR!B297","v":0},{"$f":"IMPRIMIR!C297","v":0},{"$f":"IF(E298=0,0,IMPRIMIR!D297)","v":0},{"$f":"IF(E298=0,0,IMPRIMIR!E297)","v":0},0,0,0]
[null,{"$f":"IF(E299=0,0,IMPRIMIR!A298)","v":0},{"$f":"IF(E299=0,0,IMPRIMIR!$D$3)","v":0},0,{"$f":"IMPRIMIR!B298","v":0},{"$f":"IMPRIMIR!C298","v":0},{"$f":"IF(E299=0,0,IMPRIMIR!D298)","v":0},{"$f":"IF(E299=0,0,IMPRIMIR!E298)","v":0},0,0,0]
[null,{"$f":"IF(E300=0,0,IMPRIMIR!A299)","v":0},{"$f":"IF(E300=0,0,IMPRIMIR!$D$3)","v":0},0,{"$f":"IMPRIMIR!B299","v":0},{"$f":"IMPRIMIR!C299","v":0},{"$f":"IF(E300=0,0,IMPRIMIR!D299)","v":0},{"$f":"IF(E300=0,0,IMPRIMIR!E299)","v":0},0,0,0]
[null,{"$f":"IF(E301=0,0,IMPRIMIR!A300)","v":0},{"$f":"IF(E301=0,0,IMPRIMIR!$D$3)","v":0},0,{"$f":"IMPRIMIR!B300","v":0},{"$f":"IMPRIMIR!C300","v":0},{"$f":"IF(E301=0,0,IMPRIMIR!D300)","v":0},{"$f":"IF(E301=0,0,IMPRIMIR!E300)","v":0},0,0,0]
[null,{"$f":"IF(E302=0,0,IMPRIMIR!A301)","v":0},{"$f":"IF(E302=0,0,IMPRIMIR!$D$3)","v":0},0,{"$f":"IMPRIMIR!B301","v":0},{"$f":"IMPRIMIR!C301","v":0},{"$f":"IF(E302=0,0,IMPRIMIR!D301)","v":0},{"$f":"IF(E302=0,0,IMPRIMIR!E301)","v":0},0,0,0]
[null,{"$f":"IF(E303=0,0,IMPRIMIR!A302)","v":0},{"$f":"IF(E303=0,0,IMPRIMIR!$D$3)","v":0},0,{"$f":"IMPRIMIR!B302","v":0},{"$f":"IMPRIMIR!C302","v":0},{"$f":"IF(E303=0,0,IMPRIMIR!D302)","v":0},{"$f":"IF(E303=0,0,IMPRIMIR!E302)","v":0},0,0,0]
[null,{"$f":"IF(E304=0,0,IMPRIMIR!A303)","v":0},{"$f":"IF(E304=0,0,IMPRIMIR!$D$3)","v":0},0,{"$f":"IMPRIMIR!B303","v":0},{"$f":"IMPRIMIR!C303","v":0},{"$f":"IF(E304=0,0,IMPRIMIR!D303)","v":0},{"$f":"IF(E304=0,0,IMPRIMIR!E303)","v":0},0,0,0]
[null,{"$f":"IF(E305=0,0,IMPRIMIR!A304)","v":0},{"$f":"IF(E305=0,0,IMPRIMIR!$D$3)","v":0},0,{"$f":"IMPRIMIR!B304","v":0},{"$f":"IMPRIMIR!C304","v":0},{"$f":"IF(E305=0,0,IMPRIMIR!D304)","v":0},{"$f":"IF(E305=0,0,IMPRIMIR!E304)","v":0},0,0,0]
[null,{"$f":"IF(E306=0,0,IMPRIMIR!A305)","v":0},{"$f":"IF(E306=0,0,IMPRIMIR!$D$3)","v":0},0,{"$f":"IMPRIMIR!B305","v":0},{"$f":"IMPRIMIR!C305","v":0},{"$f":"IF(E306=0,0,IMPRIMIR!D305)","v":0},{"$f":"IF(E306=0,0,IMPRIMIR!E305)","v":0},0,0,0]
[null,{"$f":"IF(E307=0,0,IMPRIMIR!A306)","v":0},{"$f":"IF(E307=0,0,IMPRIMIR!$D$3)","v":0},0,{"$f":"IMPRIMIR!B306","v":0},{"$f":"IMPRIMIR!C306","v":0},{"$f":"IF(E307=0,0,IMPRIMIR!D306)","v":0},{"$f":"IF(E307=0,0,IMPRIMIR!E306)","v":0},0,0,0]
[null,{"$f":"IF(E308=0,0,IMPRIMIR!A307)","v":0},{"$f":"IF(E308=0,0,IMPRIMIR!$D$3)","v":0},0,{"$f":"IMPRIMIR!B307","v":0},{"$f":"IMPRIMIR!C307","v":0},{"$f":"IF(E308=0,0,IMPRIMIR!D307)","v":0},{"$f":"IF(E308=0,0,IMPRIMIR!E307)","v":0},0,0,0]
[null,{"$f":"IF(E309=0,0,IMPRIMIR!A308)","v":"ba UNIÓN TRANSITORIA"},{"$f":"IF(E309=0,0,IMPRIMIR!$D$3)","v":0},0,{"$f":"IMPRIMIR!B308","v":"0"},{"$f":"IMPRIMIR!C308","v":"0"},{"$f":"IF(E309=0,0,IMPRIMIR!D308)","v":"FONDO COMÚN OPERATIVO -en pesos o moneda convenida-:"},{"$f":"IF(E309=0,0,IMPRIMIR!E308)","v":"INCOMPLETO RECHAZAR"},0,0,0]
[null,{"$f":"IF(E310=0,0,IMPRIMIR!A309)","v":0},{"$f":"IF(E310=0,0,IMPRIMIR!$D$3)","v":0},0,{"$f":"IMPRIMIR!B309","v":0},{"$f":"IMPRIMIR!C309","v":0},{"$f":"IF(E310=0,0,IMPRIMIR!D309)","v":0},{"$f":"IF(E310=0,0,IMPRIMIR!E309)","v":0},0,0,0]
[null,{"$f":"IF(E311=0,0,IMPRIMIR!A310)","v":0},{"$f":"IF(E311=0,0,IMPRIMIR!$D$3)","v":0},0,{"$f":"IMPRIMIR!B310","v":0},{"$f":"IMPRIMIR!C310","v":0},{"$f":"IF(E311=0,0,IMPRIMIR!D310)","v":0},{"$f":"IF(E311=0,0,IMPRIMIR!E310)","v":0},0,0,0]
[null,{"$f":"IF(E312=0,0,IMPRIMIR!A311)","v":0},{"$f":"IF(E312=0,0,IMPRIMIR!$D$3)","v":0},0,{"$f":"IMPRIMIR!B311","v":0},{"$f":"IMPRIMIR!C311","v":0},{"$f":"IF(E312=0,0,IMPRIMIR!D311)","v":0},{"$f":"IF(E312=0,0,IMPRIMIR!E311)","v":0},0,0,0]
[null,{"$f":"IF(E313=0,0,IMPRIMIR!A312)","v":0},{"$f":"IF(E313=0,0,IMPRIMIR!$D$3)","v":0},0,{"$f":"IMPRIMIR!B312","v":0},{"$f":"IMPRIMIR!C312","v":0},{"$f":"IF(E313=0,0,IMPRIMIR!D312)","v":0},{"$f":"IF(E313=0,0,IMPRIMIR!E312)","v":0},0,0,0]
[null,{"$f":"IF(E314=0,0,IMPRIMIR!A313)","v":0},{"$f":"IF(E314=0,0,IMPRIMIR!$D$3)","v":0},0,{"$f":"IMPRIMIR!B313","v":0},{"$f":"IMPRIMIR!C313","v":0},{"$f":"IF(E314=0,0,IMPRIMIR!D313)","v":0},{"$f":"IF(E314=0,0,IMPRIMIR!E313)","v":0},0,0,0]
[null,{"$f":"IF(E315=0,0,IMPRIMIR!A314)","v":0},{"$f":"IF(E315=0,0,IMPRIMIR!$D$3)","v":0},0,{"$f":"IMPRIMIR!B314","v":0},{"$f":"IMPRIMIR!C314","v":0},{"$f":"IF(E315=0,0,IMPRIMIR!D314)","v":0},{"$f":"IF(E315=0,0,IMPRIMIR!E314)","v":0},0,0,0]
[null,{"$f":"IF(E316=0,0,IMPRIMIR!A315)","v":0},{"$f":"IF(E316=0,0,IMPRIMIR!$D$3)","v":0},0,{"$f":"IMPRIMIR!B315","v":0},{"$f":"IMPRIMIR!C315","v":0},{"$f":"IF(E316=0,0,IMPRIMIR!D315)","v":0},{"$f":"IF(E316=0,0,IMPRIMIR!E315)","v":0},0,0,0]
[null,{"$f":"IF(E317=0,0,IMPRIMIR!A316)","v":0},{"$f":"IF(E317=0,0,IMPRIMIR!$D$3)","v":0},0,{"$f":"IMPRIMIR!B316","v":0},{"$f":"IMPRIMIR!C316","v":0},{"$f":"IF(E317=0,0,IMPRIMIR!D316)","v":0},{"$f":"IF(E317=0,0,IMPRIMIR!E316)","v":0},0,0,0]
[null,{"$f":"IF(E318=0,0,IMPRIMIR!A317)","v":0},{"$f":"IF(E318=0,0,IMPRIMIR!$D$3)","v":0},0,{"$f":"IMPRIMIR!B317","v":0},{"$f":"IMPRIMIR!C317","v":0},{"$f":"IF(E318=0,0,IMPRIMIR!D317)","v":0},{"$f":"IF(E318=0,0,IMPRIMIR!E317)","v":0},0,0,0]
[null,{"$f":"IF(E319=0,0,IMPRIMIR!A318)","v":0},{"$f":"IF(E319=0,0,IMPRIMIR!$D$3)","v":0},0,{"$f":"IMPRIMIR!B318","v":0},{"$f":"IMPRIMIR!C318","v":0},{"$f":"IF(E319=0,0,IMPRIMIR!D318)","v":0},{"$f":"IF(E319=0,0,IMPRIMIR!E318)","v":0},0,0,0]
[null,{"$f":"IF(E320=0,0,IMPRIMIR!A319)","v":0},{"$f":"IF(E320=0,0,IMPRIMIR!$D$3)","v":0},0,{"$f":"IMPRIMIR!B319","v":0},{"$f":"IMPRIMIR!C319","v":0},{"$f":"IF(E320=0,0,IMPRIMIR!D319)","v":0},{"$f":"IF(E320=0,0,IMPRIMIR!E319)","v":0},0,0,0]
[null,{"$f":"IF(E321=0,0,IMPRIMIR!A320)","v":0},{"$f":"IF(E321=0,0,IMPRIMIR!$D$3)","v":0},0,{"$f":"IMPRIMIR!B320","v":0},{"$f":"IMPRIMIR!C320","v":0},{"$f":"IF(E321=0,0,IMPRIMIR!D320)","v":0},{"$f":"IF(E321=0,0,IMPRIMIR!E320)","v":0},0,0,0]
[null,{"$f":"IF(E322=0,0,IMPRIMIR!A321)","v":0},{"$f":"IF(E322=0,0,IMPRIMIR!$D$3)","v":0},0,{"$f":"IMPRIMIR!B321","v":0},{"$f":"IMPRIMIR!C321","v":0},{"$f":"IF(E322=0,0,IMPRIMIR!D321)","v":0},{"$f":"IF(E322=0,0,IMPRIMIR!E321)","v":0},0,0,0]
[null,{"$f":"IF(E323=0,0,IMPRIMIR!A322)","v":0},{"$f":"IF(E323=0,0,IMPRIMIR!$D$3)","v":0},{"$f":"IF(E323=\"0\",0,$G$2)","v":0},{"$f":"IMPRIMIR!B322","v":0},{"$f":"IMPRIMIR!C322","v":0},{"$f":"IF(E323=0,0,IMPRIMIR!D322)","v":0},{"$f":"IF(E323=0,0,IMPRIMIR!E322)","v":0},{"$f":"IF(E323=0,0,$G$2)","v":0},{"$f":"IF(E323=0,0,$G$4)","v":0},{"$f":"IF(E323=0,0,$G$3)","v":0}]
[null,{"$f":"IF(E324=0,0,IMPRIMIR!A323)","v":0},{"$f":"IF(E324=0,0,IMPRIMIR!$D$3)","v":0},0,{"$f":"IMPRIMIR!B323","v":0},{"$f":"IMPRIMIR!C323","v":0},{"$f":"IF(E324=0,0,IMPRIMIR!D323)","v":0},{"$f":"IF(E324=0,0,IMPRIMIR!E323)","v":0},0,0,0]
[null,{"$f":"IF(E325=0,0,IMPRIMIR!A324)","v":0},{"$f":"IF(E325=0,0,IMPRIMIR!$D$3)","v":0},0,{"$f":"IMPRIMIR!B324","v":0},{"$f":"IMPRIMIR!C324","v":0},{"$f":"IF(E325=0,0,IMPRIMIR!D324)","v":0},{"$f":"IF(E325=0,0,IMPRIMIR!E324)","v":0},0,0,0]
[null,{"$f":"IF(E326=0,0,IMPRIMIR!A325)","v":0},{"$f":"IF(E326=0,0,IMPRIMIR!$D$3)","v":0},0,{"$f":"IMPRIMIR!B325","v":0},{"$f":"IMPRIMIR!C325","v":0},{"$f":"IF(E326=0,0,IMPRIMIR!D325)","v":0},{"$f":"IF(E326=0,0,IMPRIMIR!E325)","v":0},0,0,0]
[null,{"$f":"IF(E327=0,0,IMPRIMIR!A326)","v":0},{"$f":"IF(E327=0,0,IMPRIMIR!$D$3)","v":0},0,{"$f":"IMPRIMIR!B326","v":0},{"$f":"IMPRIMIR!C326","v":0},{"$f":"IF(E327=0,0,IMPRIMIR!D326)","v":0},{"$f":"IF(E327=0,0,IMPRIMIR!E326)","v":0},0,0,0]
[null,{"$f":"IF(E328=0,0,IMPRIMIR!A327)","v":0},{"$f":"IF(E328=0,0,IMPRIMIR!$D$3)","v":0},0,{"$f":"IMPRIMIR!B327","v":0},{"$f":"IMPRIMIR!C327","v":0},{"$f":"IF(E328=0,0,IMPRIMIR!D327)","v":0},{"$f":"IF(E328=0,0,IMPRIMIR!E327)","v":0},0,0,0]
[null,{"$f":"IF(E329=0,0,IMPRIMIR!A328)","v":0},{"$f":"IF(E329=0,0,IMPRIMIR!$D$3)","v":0},0,{"$f":"IMPRIMIR!B328","v":0},{"$f":"IMPRIMIR!C328","v":0},{"$f":"IF(E329=0,0,IMPRIMIR!D328)","v":0},{"$f":"IF(E329=0,0,IMPRIMIR!E328)","v":0},0,0,0]
[null,{"$f":"IF(E330=0,0,IMPRIMIR!A329)","v":0},{"$f":"IF(E330=0,0,IMPRIMIR!$D$3)","v":0},0,{"$f":"IMPRIMIR!B329","v":0},{"$f":"IMPRIMIR!C329","v":0},{"$f":"IF(E330=0,0,IMPRIMIR!D329)","v":0},{"$f":"IF(E330=0,0,IMPRIMIR!E329)","v":0},0,0,0]
[null,{"$f":"IF(E331=0,0,IMPRIMIR!A330)","v":0},{"$f":"IF(E331=0,0,IMPRIMIR!$D$3)","v":0},0,{"$f":"IMPRIMIR!B330","v":0},{"$f":"IMPRIMIR!C330","v":0},{"$f":"IF(E331=0,0,IMPRIMIR!D330)","v":0},{"$f":"IF(E331=0,0,IMPRIMIR!E330)","v":0},0,0,0]
[null,{"$f":"IF(E332=0,0,IMPRIMIR!A331)","v":0},{"$f":"IF(E332=0,0,IMPRIMIR!$D$3)","v":0},0,{"$f":"IMPRIMIR!B331","v":0},{"$f":"IMPRIMIR!C331","v":0},{"$f":"IF(E332=0,0,IMPRIMIR!D331)","v":0},{"$f":"IF(E332=0,0,IMPRIMIR!E331)","v":0},0,0,0]
[null,{"$f":"IF(E333=0,0,IMPRIMIR!A332)","v":0},{"$f":"IF(E333=0,0,IMPRIMIR!$D$3)","v":0},0,{"$f":"IMPRIMIR!B332","v":0},{"$f":"IMPRIMIR!C332","v":0},{"$f":"IF(E333=0,0,IMPRIMIR!D332)","v":0},{"$f":"IF(E333=0,0,IMPRIMIR!E332)","v":0},0,0,0]
[null,{"$f":"IF(E334=0,0,IMPRIMIR!A333)","v":0},{"$f":"IF(E334=0,0,IMPRIMIR!$D$3)","v":0},0,{"$f":"IMPRIMIR!B333","v":0},{"$f":"IMPRIMIR!C333","v":0},{"$f":"IF(E334=0,0,IMPRIMIR!D333)","v":0},{"$f":"IF(E334=0,0,IMPRIMIR!E333)","v":0},0,0,0]
[null,{"$f":"IF(E335=0,0,IMPRIMIR!A334)","v":0},{"$f":"IF(E335=0,0,IMPRIMIR!$D$3)","v":0},0,{"$f":"IMPRIMIR!B334","v":0},{"$f":"IMPRIMIR!C334","v":0},{"$f":"IF(E335=0,0,IMPRIMIR!D334)","v":0},{"$f":"IF(E335=0,0,IMPRIMIR!E334)","v":0},0,0,0]
[null,{"$f":"IF(E336=0,0,IMPRIMIR!A335)","v":0},{"$f":"IF(E336=0,0,IMPRIMIR!$D$3)","v":0},0,{"$f":"IMPRIMIR!B335","v":0},{"$f":"IMPRIMIR!C335","v":0},{"$f":"IF(E336=0,0,IMPRIMIR!D335)","v":0},{"$f":"IF(E336=0,0,IMPRIMIR!E335)","v":0},0,0,0]
[null,{"$f":"IF(E337=0,0,IMPRIMIR!A336)","v":0},{"$f":"IF(E337=0,0,IMPRIMIR!$D$3)","v":0},0,{"$f":"IMPRIMIR!B336","v":0},{"$f":"IMPRIMIR!C336","v":0},{"$f":"IF(E337=0,0,IMPRIMIR!D336)","v":0},{"$f":"IF(E337=0,0,IMPRIMIR!E336)","v":0},0,0,0]
[null,{"$f":"IF(E338=0,0,IMPRIMIR!A337)","v":0},{"$f":"IF(E338=0,0,IMPRIMIR!$D$3)","v":0},0,{"$f":"IMPRIMIR!B337","v":0},{"$f":"IMPRIMIR!C337","v":0},{"$f":"IF(E338=0,0,IMPRIMIR!D337)","v":0},{"$f":"IF(E338=0,0,IMPRIMIR!E337)","v":0},0,0,0]
[null,{"$f":"IF(E339=0,0,IMPRIMIR!A338)","v":0},{"$f":"IF(E339=0,0,IMPRIMIR!$D$3)","v":0},0,{"$f":"IMPRIMIR!B338","v":0},{"$f":"IMPRIMIR!C338","v":0},{"$f":"IF(E339=0,0,IMPRIMIR!D338)","v":0},{"$f":"IF(E339=0,0,IMPRIMIR!E338)","v":0},0,0,0]
[null,{"$f":"IF(E340=0,0,IMPRIMIR!A339)","v":0},{"$f":"IF(E340=0,0,IMPRIMIR!$D$3)","v":0},0,{"$f":"IMPRIMIR!B339","v":0},{"$f":"IMPRIMIR!C339","v":0},{"$f":"IF(E340=0,0,IMPRIMIR!D339)","v":0},{"$f":"IF(E340=0,0,IMPRIMIR!E339)","v":0},0,0,0]
[null,{"$f":"IF(E341=0,0,IMPRIMIR!A340)","v":0},{"$f":"IF(E341=0,0,IMPRIMIR!$D$3)","v":0},0,{"$f":"IMPRIMIR!B340","v":0},{"$f":"IMPRIMIR!C340","v":0},{"$f":"IF(E341=0,0,IMPRIMIR!D340)","v":0},{"$f":"IF(E341=0,0,IMPRIMIR!E340)","v":0},0,0,0]
[null,{"$f":"IF(E342=0,0,IMPRIMIR!A341)","v":0},{"$f":"IF(E342=0,0,IMPRIMIR!$D$3)","v":0},0,{"$f":"IMPRIMIR!B341","v":0},{"$f":"IMPRIMIR!C341","v":0},{"$f":"IF(E342=0,0,IMPRIMIR!D341)","v":0},{"$f":"IF(E342=0,0,IMPRIMIR!E341)","v":0},0,0,0]
[null,{"$f":"IF(E343=0,0,IMPRIMIR!A342)","v":0},{"$f":"IF(E343=0,0,IMPRIMIR!$D$3)","v":0},0,{"$f":"IMPRIMIR!B342","v":0},{"$f":"IMPRIMIR!C342","v":0},{"$f":"IF(E343=0,0,IMPRIMIR!D342)","v":0},{"$f":"IF(E343=0,0,IMPRIMIR!E342)","v":0},0,0,0]
[null,{"$f":"IF(E344=0,0,IMPRIMIR!A343)","v":0},{"$f":"IF(E344=0,0,IMPRIMIR!$D$3)","v":0},0,{"$f":"IMPRIMIR!B343","v":0},{"$f":"IMPRIMIR!C343","v":0},{"$f":"IF(E344=0,0,IMPRIMIR!D343)","v":0},{"$f":"IF(E344=0,0,IMPRIMIR!E343)","v":0},0,0,0]
[null,{"$f":"IF(E345=0,0,IMPRIMIR!A344)","v":0},{"$f":"IF(E345=0,0,IMPRIMIR!$D$3)","v":0},0,{"$f":"IMPRIMIR!B344","v":0},{"$f":"IMPRIMIR!C344","v":0},{"$f":"IF(E345=0,0,IMPRIMIR!D344)","v":0},{"$f":"IF(E345=0,0,IMPRIMIR!E344)","v":0},0,0,0]
[null,{"$f":"IF(E346=0,0,IMPRIMIR!A345)","v":0},{"$f":"IF(E346=0,0,IMPRIMIR!$D$3)","v":0},0,{"$f":"IMPRIMIR!B345","v":0},{"$f":"IMPRIMIR!C345","v":0},{"$f":"IF(E346=0,0,IMPRIMIR!D345)","v":0},{"$f":"IF(E346=0,0,IMPRIMIR!E345)","v":0},0,0,0]
[null,{"$f":"IF(E347=0,0,IMPRIMIR!A346)","v":0},{"$f":"IF(E347=0,0,IMPRIMIR!$D$3)","v":0},0,{"$f":"IMPRIMIR!B346","v":0},{"$f":"IMPRIMIR!C346","v":0},{"$f":"IF(E347=0,0,IMPRIMIR!D346)","v":0},{"$f":"IF(E347=0,0,IMPRIMIR!E346)","v":0},0,0,0]
[null,{"$f":"IF(E348=0,0,IMPRIMIR!A347)","v":0},{"$f":"IF(E348=0,0,IMPRIMIR!$D$3)","v":0},0,{"$f":"IMPRIMIR!B347","v":0},{"$f":"IMPRIMIR!C347","v":0},{"$f":"IF(E348=0,0,IMPRIMIR!D347)","v":0},{"$f":"IF(E348=0,0,IMPRIMIR!E347)","v":0},0,0,0]
[null,{"$f":"IF(E349=0,0,IMPRIMIR!A348)","v":0},{"$f":"IF(E349=0,0,IMPRIMIR!$D$3)","v":0},0,{"$f":"IMPRIMIR!B348","v":0},{"$f":"IMPRIMIR!C348","v":0},{"$f":"IF(E349=0,0,IMPRIMIR!D348)","v":0},{"$f":"IF(E349=0,0,IMPRIMIR!E348)","v":0},0,0,0]
[null,{"$f":"IF(E350=0,0,IMPRIMIR!A349)","v":0},{"$f":"IF(E350=0,0,IMPRIMIR!$D$3)","v":0},0,{"$f":"IMPRIMIR!B349","v":0},{"$f":"IMPRIMIR!C349","v":0},{"$f":"IF(E350=0,0,IMPRIMIR!D349)","v":0},{"$f":"IF(E350=0,0,IMPRIMIR!E349)","v":0},0,0,0]
[null,{"$f":"IF(E351=0,0,IMPRIMIR!A350)","v":0},{"$f":"IF(E351=0,0,IMPRIMIR!$D$3)","v":0},0,{"$f":"IMPRIMIR!B350","v":0},{"$f":"IMPRIMIR!C350","v":0},{"$f":"IF(E351=0,0,IMPRIMIR!D350)","v":0},{"$f":"IF(E351=0,0,IMPRIMIR!E350)","v":0},0,0,0]
[null,{"$f":"IF(E352=0,0,IMPRIMIR!A351)","v":0},{"$f":"IF(E352=0,0,IMPRIMIR!$D$3)","v":0},0,{"$f":"IMPRIMIR!B351","v":0},{"$f":"IMPRIMIR!C351","v":0},{"$f":"IF(E352=0,0,IMPRIMIR!D351)","v":0},{"$f":"IF(E352=0,0,IMPRIMIR!E351)","v":0},0,0,0]
[null,{"$f":"IF(E353=0,0,IMPRIMIR!A352)","v":0},{"$f":"IF(E353=0,0,IMPRIMIR!$D$3)","v":0},0,{"$f":"IMPRIMIR!B352","v":0},{"$f":"IMPRIMIR!C352","v":0},{"$f":"IF(E353=0,0,IMPRIMIR!D352)","v":0},{"$f":"IF(E353=0,0,IMPRIMIR!E352)","v":0},0,0,0]
[null,{"$f":"IF(E354=0,0,IMPRIMIR!A353)","v":0},{"$f":"IF(E354=0,0,IMPRIMIR!$D$3)","v":0},0,{"$f":"IMPRIMIR!B353","v":0},{"$f":"IMPRIMIR!C353","v":0},{"$f":"IF(E354=0,0,IMPRIMIR!D353)","v":0},{"$f":"IF(E354=0,0,IMPRIMIR!E353)","v":0},0,0,0]
[null,{"$f":"IF(E355=0,0,IMPRIMIR!A354)","v":0},{"$f":"IF(E355=0,0,IMPRIMIR!$D$3)","v":0},0,{"$f":"IMPRIMIR!B354","v":0},{"$f":"IMPRIMIR!C354","v":0},{"$f":"IF(E355=0,0,IMPRIMIR!D354)","v":0},{"$f":"IF(E355=0,0,IMPRIMIR!E354)","v":0},0,0,0]
[null,{"$f":"IF(E356=0,0,IMPRIMIR!A355)","v":0},{"$f":"IF(E356=0,0,IMPRIMIR!$D$3)","v":0},0,{"$f":"IMPRIMIR!B355","v":0},{"$f":"IMPRIMIR!C355","v":0},{"$f":"IF(E356=0,0,IMPRIMIR!D355)","v":0},{"$f":"IF(E356=0,0,IMPRIMIR!E355)","v":0},0,0,0]
[null,{"$f":"IF(E357=0,0,IMPRIMIR!A356)","v":0},{"$f":"IF(E357=0,0,IMPRIMIR!$D$3)","v":0},0,{"$f":"IMPRIMIR!B356","v":0},{"$f":"IMPRIMIR!C356","v":0},{"$f":"IF(E357=0,0,IMPRIMIR!D356)","v":0},{"$f":"IF(E357=0,0,IMPRIMIR!E356)","v":0},0,0,0]
[null,{"$f":"IF(E358=0,0,IMPRIMIR!A357)","v":0},{"$f":"IF(E358=0,0,IMPRIMIR!$D$3)","v":0},0,{"$f":"IMPRIMIR!B357","v":0},{"$f":"IMPRIMIR!C357","v":0},{"$f":"IF(E358=0,0,IMPRIMIR!D357)","v":0},{"$f":"IF(E358=0,0,IMPRIMIR!E357)","v":0},0,0,0]
[null,{"$f":"IF(E359=0,0,IMPRIMIR!A358)","v":0},{"$f":"IF(E359=0,0,IMPRIMIR!$D$3)","v":0},0,{"$f":"IMPRIMIR!B358","v":0},{"$f":"IMPRIMIR!C358","v":0},{"$f":"IF(E359=0,0,IMPRIMIR!D358)","v":0},{"$f":"IF(E359=0,0,IMPRIMIR!E358)","v":0},0,0,0]
[null,{"$f":"IF(E360=0,0,IMPRIMIR!A359)","v":0},{"$f":"IF(E360=0,0,IMPRIMIR!$D$3)","v":0},0,{"$f":"IMPRIMIR!B359","v":0},{"$f":"IMPRIMIR!C359","v":0},{"$f":"IF(E360=0,0,IMPRIMIR!D359)","v":0},{"$f":"IF(E360=0,0,IMPRIMIR!E359)","v":0},0,0,0]
[null,{"$f":"IF(E361=0,0,IMPRIMIR!A360)","v":0},{"$f":"IF(E361=0,0,IMPRIMIR!$D$3)","v":0},0,{"$f":"IMPRIMIR!B360","v":0},{"$f":"IMPRIMIR!C360","v":0},{"$f":"IF(E361=0,0,IMPRIMIR!D360)","v":0},{"$f":"IF(E361=0,0,IMPRIMIR!E360)","v":0},0,0,0]
[null,{"$f":"IF(E362=0,0,IMPRIMIR!A361)","v":0},{"$f":"IF(E362=0,0,IMPRIMIR!$D$3)","v":0},0,{"$f":"IMPRIMIR!B361","v":0},{"$f":"IMPRIMIR!C361","v":0},{"$f":"IF(E362=0,0,IMPRIMIR!D361)","v":0},{"$f":"IF(E362=0,0,IMPRIMIR!E361)","v":0},0,0,0]
[null,{"$f":"IF(E363=0,0,IMPRIMIR!A362)","v":0},{"$f":"IF(E363=0,0,IMPRIMIR!$D$3)","v":0},0,{"$f":"IMPRIMIR!B362","v":0},{"$f":"IMPRIMIR!C362","v":0},{"$f":"IF(E363=0,0,IMPRIMIR!D362)","v":0},{"$f":"IF(E363=0,0,IMPRIMIR!E362)","v":0},0,0,0]
[null,{"$f":"IF(E364=0,0,IMPRIMIR!A363)","v":0},{"$f":"IF(E364=0,0,IMPRIMIR!$D$3)","v":0},0,{"$f":"IMPRIMIR!B363","v":0},{"$f":"IMPRIMIR!C363","v":0},{"$f":"IF(E364=0,0,IMPRIMIR!D363)","v":0},{"$f":"IF(E364=0,0,IMPRIMIR!E363)","v":0},0,0,0]
[null,{"$f":"IF(E365=0,0,IMPRIMIR!A364)","v":0},{"$f":"IF(E365=0,0,IMPRIMIR!$D$3)","v":0},0,{"$f":"IMPRIMIR!B364","v":0},{"$f":"IMPRIMIR!C364","v":0},{"$f":"IF(E365=0,0,IMPRIMIR!D364)","v":0},{"$f":"IF(E365=0,0,IMPRIMIR!E364)","v":0},0,0,0]
[null,{"$f":"IF(E366=0,0,IMPRIMIR!A365)","v":0},{"$f":"IF(E366=0,0,IMPRIMIR!$D$3)","v":0},0,{"$f":"IMPRIMIR!B365","v":0},{"$f":"IMPRIMIR!C365","v":0},{"$f":"IF(E366=0,0,IMPRIMIR!D365)","v":0},{"$f":"IF(E366=0,0,IMPRIMIR!E365)","v":0},0,0,0]
[null,{"$f":"IF(E367=0,0,IMPRIMIR!A366)","v":0},{"$f":"IF(E367=0,0,IMPRIMIR!$D$3)","v":0},0,{"$f":"IMPRIMIR!B366","v":0},{"$f":"IMPRIMIR!C366","v":0},{"$f":"IF(E367=0,0,IMPRIMIR!D366)","v":0},{"$f":"IF(E367=0,0,IMPRIMIR!E366)","v":0},0,0,0]
[null,{"$f":"IF(E368=0,0,IMPRIMIR!A367)","v":0},{"$f":"IF(E368=0,0,IMPRIMIR!$D$3)","v":0},0,{"$f":"IMPRIMIR!B367","v":0},{"$f":"IMPRIMIR!C367","v":0},{"$f":"IF(E368=0,0,IMPRIMIR!D367)","v":0},{"$f":"IF(E368=0,0,IMPRIMIR!E367)","v":0},0,0,0]
[null,{"$f":"IF(E369=0,0,IMPRIMIR!A368)","v":0},{"$f":"IF(E369=0,0,IMPRIMIR!$D$3)","v":0},0,{"$f":"IMPRIMIR!B368","v":0},{"$f":"IMPRIMIR!C368","v":0},{"$f":"IF(E369=0,0,IMPRIMIR!D368)","v":0},{"$f":"IF(E369=0,0,IMPRIMIR!E368)","v":0},0,0,0]
[null,{"$f":"IF(E370=0,0,IMPRIMIR!A369)","v":0},{"$f":"IF(E370=0,0,IMPRIMIR!$D$3)","v":0},0,{"$f":"IMPRIMIR!B369","v":0},{"$f":"IMPRIMIR!C369","v":0},{"$f":"IF(E370=0,0,IMPRIMIR!D369)","v":0},{"$f":"IF(E370=0,0,IMPRIMIR!E369)","v":0},0,0,0]
[null,{"$f":"IF(E371=0,0,IMPRIMIR!A370)","v":0},{"$f":"IF(E371=0,0,IMPRIMIR!$D$3)","v":0},{"$f":"IF(E371=\"0\",0,$G$2)","v":0},{"$f":"IMPRIMIR!B370","v":0},{"$f":"IMPRIMIR!C370","v":0},{"$f":"IF(E371=0,0,IMPRIMIR!D370)","v":0},{"$f":"IF(E371=0,0,IMPRIMIR!E370)","v":0},{"$f":"IF(E371=0,0,$G$2)","v":0},{"$f":"IF(E371=0,0,$G$4)","v":0},{"$f":"IF(E371=0,0,$G$3)","v":0}]
[null,{"$f":"IF(E372=0,0,IMPRIMIR!A371)","v":0},{"$f":"IF(E372=0,0,IMPRIMIR!$D$3)","v":0},0,{"$f":"IMPRIMIR!B371","v":0},{"$f":"IMPRIMIR!C371","v":0},{"$f":"IF(E372=0,0,IMPRIMIR!D371)","v":0},{"$f":"IF(E372=0,0,IMPRIMIR!E371)","v":0},0,0,0]
[null,{"$f":"IF(E373=0,0,IMPRIMIR!A372)","v":0},{"$f":"IF(E373=0,0,IMPRIMIR!$D$3)","v":0},0,{"$f":"IMPRIMIR!B372","v":0},{"$f":"IMPRIMIR!C372","v":0},{"$f":"IF(E373=0,0,IMPRIMIR!D372)","v":0},{"$f":"IF(E373=0,0,IMPRIMIR!E372)","v":0},0,0,0]
[null,{"$f":"IF(E374=0,0,IMPRIMIR!A373)","v":0},{"$f":"IF(E374=0,0,IMPRIMIR!$D$3)","v":0},0,{"$f":"IMPRIMIR!B373","v":0},{"$f":"IMPRIMIR!C373","v":0},{"$f":"IF(E374=0,0,IMPRIMIR!D373)","v":0},{"$f":"IF(E374=0,0,IMPRIMIR!E373)","v":0},0,0,0]
[null,{"$f":"IF(E375=0,0,IMPRIMIR!A374)","v":0},{"$f":"IF(E375=0,0,IMPRIMIR!$D$3)","v":0},0,{"$f":"IMPRIMIR!B374","v":0},{"$f":"IMPRIMIR!C374","v":0},{"$f":"IF(E375=0,0,IMPRIMIR!D374)","v":0},{"$f":"IF(E375=0,0,IMPRIMIR!E374)","v":0},0,0,0]
[null,{"$f":"IF(E376=0,0,IMPRIMIR!A375)","v":0},{"$f":"IF(E376=0,0,IMPRIMIR!$D$3)","v":0},0,{"$f":"IMPRIMIR!B375","v":0},{"$f":"IMPRIMIR!C375","v":0},{"$f":"IF(E376=0,0,IMPRIMIR!D375)","v":0},{"$f":"IF(E376=0,0,IMPRIMIR!E375)","v":0},0,0,0]
[null,{"$f":"IF(E377=0,0,IMPRIMIR!A376)","v":0},{"$f":"IF(E377=0,0,IMPRIMIR!$D$3)","v":0},0,{"$f":"IMPRIMIR!B376","v":0},{"$f":"IMPRIMIR!C376","v":0},{"$f":"IF(E377=0,0,IMPRIMIR!D376)","v":0},{"$f":"IF(E377=0,0,IMPRIMIR!E376)","v":0},0,0,0]
[null,{"$f":"IF(E378=0,0,IMPRIMIR!A377)","v":0},{"$f":"IF(E378=0,0,IMPRIMIR!$D$3)","v":0},0,{"$f":"IMPRIMIR!B377","v":0},{"$f":"IMPRIMIR!C377","v":0},{"$f":"IF(E378=0,0,IMPRIMIR!D377)","v":0},{"$f":"IF(E378=0,0,IMPRIMIR!E377)","v":0},0,0,0]
[null,{"$f":"IF(E379=0,0,IMPRIMIR!A378)","v":0},{"$f":"IF(E379=0,0,IMPRIMIR!$D$3)","v":0},0,{"$f":"IMPRIMIR!B378","v":0},{"$f":"IMPRIMIR!C378","v":0},{"$f":"IF(E379=0,0,IMPRIMIR!D378)","v":0},{"$f":"IF(E379=0,0,IMPRIMIR!E378)","v":0},0,0,0]
[null,{"$f":"IF(E380=0,0,IMPRIMIR!A379)","v":0},{"$f":"IF(E380=0,0,IMPRIMIR!$D$3)","v":0},0,{"$f":"IMPRIMIR!B379","v":0},{"$f":"IMPRIMIR!C379","v":0},{"$f":"IF(E380=0,0,IMPRIMIR!D379)","v":0},{"$f":"IF(E380=0,0,IMPRIMIR!E379)","v":0},0,0,0]
[null,{"$f":"IF(E381=0,0,IMPRIMIR!A380)","v":0},{"$f":"IF(E381=0,0,IMPRIMIR!$D$3)","v":0},0,{"$f":"IMPRIMIR!B380","v":0},{"$f":"IMPRIMIR!C380","v":0},{"$f":"IF(E381=0,0,IMPRIMIR!D380)","v":0},{"$f":"IF(E381=0,0,IMPRIMIR!E380)","v":0},0,0,0]
[null,{"$f":"IF(E382=0,0,IMPRIMIR!A381)","v":0},{"$f":"IF(E382=0,0,IMPRIMIR!$D$3)","v":0},0,{"$f":"IMPRIMIR!B381","v":0},{"$f":"IMPRIMIR!C381","v":0},{"$f":"IF(E382=0,0,IMPRIMIR!D381)","v":0},{"$f":"IF(E382=0,0,IMPRIMIR!E381)","v":0},0,0,0]
[null,{"$f":"IF(E383=0,0,IMPRIMIR!A382)","v":0},{"$f":"IF(E383=0,0,IMPRIMIR!$D$3)","v":0},0,{"$f":"IMPRIMIR!B382","v":0},{"$f":"IMPRIMIR!C382","v":0},{"$f":"IF(E383=0,0,IMPRIMIR!D382)","v":0},{"$f":"IF(E383=0,0,IMPRIMIR!E382)","v":0},0,0,0]
[null,{"$f":"IF(E384=0,0,IMPRIMIR!A383)","v":0},{"$f":"IF(E384=0,0,IMPRIMIR!$D$3)","v":0},0,{"$f":"IMPRIMIR!B383","v":0},{"$f":"IMPRIMIR!C383","v":0},{"$f":"IF(E384=0,0,IMPRIMIR!D383)","v":0},{"$f":"IF(E384=0,0,IMPRIMIR!E383)","v":0},0,0,0]
[null,{"$f":"IF(E385=0,0,IMPRIMIR!A384)","v":0},{"$f":"IF(E385=0,0,IMPRIMIR!$D$3)","v":0},0,{"$f":"IMPRIMIR!B384","v":0},{"$f":"IMPRIMIR!C384","v":0},{"$f":"IF(E385=0,0,IMPRIMIR!D384)","v":0},{"$f":"IF(E385=0,0,IMPRIMIR!E384)","v":0},0,0,0]
[null,{"$f":"IF(E386=0,0,IMPRIMIR!A385)","v":0},{"$f":"IF(E386=0,0,IMPRIMIR!$D$3)","v":0},0,{"$f":"IMPRIMIR!B385","v":0},{"$f":"IMPRIMIR!C385","v":0},{"$f":"IF(E386=0,0,IMPRIMIR!D385)","v":0},{"$f":"IF(E386=0,0,IMPRIMIR!E385)","v":0},0,0,0]
[null,{"$f":"IF(E387=0,0,IMPRIMIR!A386)","v":0},{"$f":"IF(E387=0,0,IMPRIMIR!$D$3)","v":0},0,{"$f":"IMPRIMIR!B386","v":0},{"$f":"IMPRIMIR!C386","v":0},{"$f":"IF(E387=0,0,IMPRIMIR!D386)","v":0},{"$f":"IF(E387=0,0,IMPRIMIR!E386)","v":0},0,0,0]
[null,{"$f":"IF(E388=0,0,IMPRIMIR!A387)","v":0},{"$f":"IF(E388=0,0,IMPRIMIR!$D$3)","v":0},0,{"$f":"IMPRIMIR!B387","v":0},{"$f":"IMPRIMIR!C387","v":0},{"$f":"IF(E388=0,0,IMPRIMIR!D387)","v":0},{"$f":"IF(E388=0,0,IMPRIMIR!E387)","v":0},0,0,0]
[null,{"$f":"IF(E389=0,0,IMPRIMIR!A388)","v":0},{"$f":"IF(E389=0,0,IMPRIMIR!$D$3)","v":0},0,{"$f":"IMPRIMIR!B388","v":0},{"$f":"IMPRIMIR!C388","v":0},{"$f":"IF(E389=0,0,IMPRIMIR!D388)","v":0},{"$f":"IF(E389=0,0,IMPRIMIR!E388)","v":0},0,0,0]
[null,{"$f":"IF(E390=0,0,IMPRIMIR!A389)","v":0},{"$f":"IF(E390=0,0,IMPRIMIR!$D$3)","v":0},0,{"$f":"IMPRIMIR!B389","v":0},{"$f":"IMPRIMIR!C389","v":0},{"$f":"IF(E390=0,0,IMPRIMIR!D389)","v":0},{"$f":"IF(E390=0,0,IMPRIMIR!E389)","v":0},0,0,0]
[null,{"$f":"IF(E391=0,0,IMPRIMIR!A390)","v":0},{"$f":"IF(E391=0,0,IMPRIMIR!$D$3)","v":0},0,{"$f":"IMPRIMIR!B390","v":0},{"$f":"IMPRIMIR!C390","v":0},{"$f":"IF(E391=0,0,IMPRIMIR!D390)","v":0},{"$f":"IF(E391=0,0,IMPRIMIR!E390)","v":0},0,0,0]
[null,{"$f":"IF(E392=0,0,IMPRIMIR!A391)","v":0},{"$f":"IF(E392=0,0,IMPRIMIR!$D$3)","v":0},0,{"$f":"IMPRIMIR!B391","v":0},{"$f":"IMPRIMIR!C391","v":0},{"$f":"IF(E392=0,0,IMPRIMIR!D391)","v":0},{"$f":"IF(E392=0,0,IMPRIMIR!E391)","v":0},0,0,0]
[null,{"$f":"IF(E393=0,0,IMPRIMIR!A392)","v":0},{"$f":"IF(E393=0,0,IMPRIMIR!$D$3)","v":0},0,{"$f":"IMPRIMIR!B392","v":0},{"$f":"IMPRIMIR!C392","v":0},{"$f":"IF(E393=0,0,IMPRIMIR!D392)","v":0},{"$f":"IF(E393=0,0,IMPRIMIR!E392)","v":0},0,0,0]
[null,{"$f":"IF(E394=0,0,IMPRIMIR!A393)","v":0},{"$f":"IF(E394=0,0,IMPRIMIR!$D$3)","v":0},0,{"$f":"IMPRIMIR!B393","v":0},{"$f":"IMPRIMIR!C393","v":0},{"$f":"IF(E394=0,0,IMPRIMIR!D393)","v":0},{"$f":"IF(E394=0,0,IMPRIMIR!E393)","v":0},0,0,0]
[null,{"$f":"IF(E395=0,0,IMPRIMIR!A394)","v":0},{"$f":"IF(E395=0,0,IMPRIMIR!$D$3)","v":0},0,{"$f":"IMPRIMIR!B394","v":0},{"$f":"IMPRIMIR!C394","v":0},{"$f":"IF(E395=0,0,IMPRIMIR!D394)","v":0},{"$f":"IF(E395=0,0,IMPRIMIR!E394)","v":0},0,0,0]
[null,{"$f":"IF(E396=0,0,IMPRIMIR!A395)","v":0},{"$f":"IF(E396=0,0,IMPRIMIR!$D$3)","v":0},0,{"$f":"IMPRIMIR!B395","v":0},{"$f":"IMPRIMIR!C395","v":0},{"$f":"IF(E396=0,0,IMPRIMIR!D395)","v":0},{"$f":"IF(E396=0,0,IMPRIMIR!E395)","v":0},0,0,0]
[null,{"$f":"IF(E397=0,0,IMPRIMIR!A396)","v":0},{"$f":"IF(E397=0,0,IMPRIMIR!$D$3)","v":0},0,{"$f":"IMPRIMIR!B396","v":0},{"$f":"IMPRIMIR!C396","v":0},{"$f":"IF(E397=0,0,IMPRIMIR!D396)","v":0},{"$f":"IF(E397=0,0,IMPRIMIR!E396)","v":0},0,0,0]
[null,{"$f":"IF(E398=0,0,IMPRIMIR!A397)","v":0},{"$f":"IF(E398=0,0,IMPRIMIR!$D$3)","v":0},0,{"$f":"IMPRIMIR!B397","v":0},{"$f":"IMPRIMIR!C397","v":0},{"$f":"IF(E398=0,0,IMPRIMIR!D397)","v":0},{"$f":"IF(E398=0,0,IMPRIMIR!E397)","v":0},0,0,0]
[null,{"$f":"IF(E399=0,0,IMPRIMIR!A398)","v":0},{"$f":"IF(E399=0,0,IMPRIMIR!$D$3)","v":0},0,{"$f":"IMPRIMIR!B398","v":0},{"$f":"IMPRIMIR!C398","v":0},{"$f":"IF(E399=0,0,IMPRIMIR!D398)","v":0},{"$f":"IF(E399=0,0,IMPRIMIR!E398)","v":0},0,0,0]
[null,{"$f":"IF(E400=0,0,IMPRIMIR!A399)","v":0},{"$f":"IF(E400=0,0,IMPRIMIR!$D$3)","v":0},0,{"$f":"IMPRIMIR!B399","v":0},{"$f":"IMPRIMIR!C399","v":0},{"$f":"IF(E400=0,0,IMPRIMIR!D399)","v":0},{"$f":"IF(E400=0,0,IMPRIMIR!E399)","v":0},0,0,0]
[null,{"$f":"IF(E401=0,0,IMPRIMIR!A400)","v":0},{"$f":"IF(E401=0,0,IMPRIMIR!$D$3)","v":0},0,{"$f":"IMPRIMIR!B400","v":0},{"$f":"IMPRIMIR!C400","v":0},{"$f":"IF(E401=0,0,IMPRIMIR!D400)","v":0},{"$f":"IF(E401=0,0,IMPRIMIR!E400)","v":0},0,0,0]
[null,{"$f":"IF(E402=0,0,IMPRIMIR!A401)","v":0},{"$f":"IF(E402=0,0,IMPRIMIR!$D$3)","v":0},0,{"$f":"IMPRIMIR!B401","v":0},{"$f":"IMPRIMIR!C401","v":0},{"$f":"IF(E402=0,0,IMPRIMIR!D401)","v":0},{"$f":"IF(E402=0,0,IMPRIMIR!E401)","v":0},0,0,0]
[null,{"$f":"IF(E403=0,0,IMPRIMIR!A402)","v":0},{"$f":"IF(E403=0,0,IMPRIMIR!$D$3)","v":0},0,{"$f":"IMPRIMIR!B402","v":0},{"$f":"IMPRIMIR!C402","v":0},{"$f":"IF(E403=0,0,IMPRIMIR!D402)","v":0},{"$f":"IF(E403=0,0,IMPRIMIR!E402)","v":0},0,0,0]
[null,{"$f":"IF(E404=0,0,IMPRIMIR!A403)","v":0},{"$f":"IF(E404=0,0,IMPRIMIR!$D$3)","v":0},0,{"$f":"IMPRIMIR!B403","v":0},{"$f":"IMPRIMIR!C403","v":0},{"$f":"IF(E404=0,0,IMPRIMIR!D403)","v":0},{"$f":"IF(E404=0,0,IMPRIMIR!E403)","v":0},0,0,0]
[null,{"$f":"IF(E405=0,0,IMPRIMIR!A404)","v":0},{"$f":"IF(E405=0,0,IMPRIMIR!$D$3)","v":0},0,{"$f":"IMPRIMIR!B404","v":0},{"$f":"IMPRIMIR!C404","v":0},{"$f":"IF(E405=0,0,IMPRIMIR!D404)","v":0},{"$f":"IF(E405=0,0,IMPRIMIR!E404)","v":0},0,0,0]
[null,{"$f":"IF(E406=0,0,IMPRIMIR!A405)","v":0},{"$f":"IF(E406=0,0,IMPRIMIR!$D$3)","v":0},0,{"$f":"IMPRIMIR!B405","v":0},{"$f":"IMPRIMIR!C405","v":0},{"$f":"IF(E406=0,0,IMPRIMIR!D405)","v":0},{"$f":"IF(E406=0,0,IMPRIMIR!E405)","v":0},0,0,0]
[null,{"$f":"IF(E407=0,0,IMPRIMIR!A406)","v":0},{"$f":"IF(E407=0,0,IMPRIMIR!$D$3)","v":0},0,{"$f":"IMPRIMIR!B406","v":0},{"$f":"IMPRIMIR!C406","v":0},{"$f":"IF(E407=0,0,IMPRIMIR!D406)","v":0},{"$f":"IF(E407=0,0,IMPRIMIR!E406)","v":0},0,0,0]
[null,{"$f":"IF(E408=0,0,IMPRIMIR!A407)","v":0},{"$f":"IF(E408=0,0,IMPRIMIR!$D$3)","v":0},0,{"$f":"IMPRIMIR!B407","v":0},{"$f":"IMPRIMIR!C407","v":0},{"$f":"IF(E408=0,0,IMPRIMIR!D407)","v":0},{"$f":"IF(E408=0,0,IMPRIMIR!E407)","v":0},0,0,0]
[null,{"$f":"IF(E409=0,0,IMPRIMIR!A408)","v":0},{"$f":"IF(E409=0,0,IMPRIMIR!$D$3)","v":0},0,{"$f":"IMPRIMIR!B408","v":0},{"$f":"IMPRIMIR!C408","v":0},{"$f":"IF(E409=0,0,IMPRIMIR!D408)","v":0},{"$f":"IF(E409=0,0,IMPRIMIR!E408)","v":0},0,0,0]
[null,{"$f":"IF(E410=0,0,IMPRIMIR!A409)","v":0},{"$f":"IF(E410=0,0,IMPRIMIR!$D$3)","v":0},0,{"$f":"IMPRIMIR!B409","v":0},{"$f":"IMPRIMIR!C409","v":0},{"$f":"IF(E410=0,0,IMPRIMIR!D409)","v":0},{"$f":"IF(E410=0,0,IMPRIMIR!E409)","v":0},0,0,0]
[null,{"$f":"IF(E411=0,0,IMPRIMIR!A410)","v":0},{"$f":"IF(E411=0,0,IMPRIMIR!$D$3)","v":0},0,{"$f":"IMPRIMIR!B410","v":0},{"$f":"IMPRIMIR!C410","v":0},{"$f":"IF(E411=0,0,IMPRIMIR!D410)","v":0},{"$f":"IF(E411=0,0,IMPRIMIR!E410)","v":0},0,0,0]
[null,{"$f":"IF(E412=0,0,IMPRIMIR!A411)","v":0},{"$f":"IF(E412=0,0,IMPRIMIR!$D$3)","v":0},0,{"$f":"IMPRIMIR!B411","v":0},{"$f":"IMPRIMIR!C411","v":0},{"$f":"IF(E412=0,0,IMPRIMIR!D411)","v":0},{"$f":"IF(E412=0,0,IMPRIMIR!E411)","v":0},0,0,0]
[null,{"$f":"IF(E413=0,0,IMPRIMIR!A412)","v":0},{"$f":"IF(E413=0,0,IMPRIMIR!$D$3)","v":0},0,{"$f":"IMPRIMIR!B412","v":0},{"$f":"IMPRIMIR!C412","v":0},{"$f":"IF(E413=0,0,IMPRIMIR!D412)","v":0},{"$f":"IF(E413=0,0,IMPRIMIR!E412)","v":0},0,0,0]
[null,{"$f":"IF(E414=0,0,IMPRIMIR!A413)","v":0},{"$f":"IF(E414=0,0,IMPRIMIR!$D$3)","v":0},0,{"$f":"IMPRIMIR!B413","v":0},{"$f":"IMPRIMIR!C413","v":0},{"$f":"IF(E414=0,0,IMPRIMIR!D413)","v":0},{"$f":"IF(E414=0,0,IMPRIMIR!E413)","v":0},0,0,0]
[null,{"$f":"IF(E415=0,0,IMPRIMIR!A414)","v":0},{"$f":"IF(E415=0,0,IMPRIMIR!$D$3)","v":0},0,{"$f":"IMPRIMIR!B414","v":0},{"$f":"IMPRIMIR!C414","v":0},{"$f":"IF(E415=0,0,IMPRIMIR!D414)","v":0},{"$f":"IF(E415=0,0,IMPRIMIR!E414)","v":0},0,0,0]
[null,{"$f":"IF(E416=0,0,IMPRIMIR!A415)","v":0},{"$f":"IF(E416=0,0,IMPRIMIR!$D$3)","v":0},0,{"$f":"IMPRIMIR!B415","v":0},{"$f":"IMPRIMIR!C415","v":0},{"$f":"IF(E416=0,0,IMPRIMIR!D415)","v":0},{"$f":"IF(E416=0,0,IMPRIMIR!E415)","v":0},0,0,0]
[null,{"$f":"IF(E417=0,0,IMPRIMIR!A416)","v":0},{"$f":"IF(E417=0,0,IMPRIMIR!$D$3)","v":0},0,{"$f":"IMPRIMIR!B416","v":0},{"$f":"IMPRIMIR!C416","v":0},{"$f":"IF(E417=0,0,IMPRIMIR!D416)","v":0},{"$f":"IF(E417=0,0,IMPRIMIR!E416)","v":0},0,0,0]
[null,{"$f":"IF(E418=0,0,IMPRIMIR!A417)","v":0},{"$f":"IF(E418=0,0,IMPRIMIR!$D$3)","v":0},0,{"$f":"IMPRIMIR!B417","v":0},{"$f":"IMPRIMIR!C417","v":0},{"$f":"IF(E418=0,0,IMPRIMIR!D417)","v":0},{"$f":"IF(E418=0,0,IMPRIMIR!E417)","v":0},0,0,0]
[null,{"$f":"IF(E419=0,0,IMPRIMIR!A418)","v":0},{"$f":"IF(E419=0,0,IMPRIMIR!$D$3)","v":0},0,{"$f":"IMPRIMIR!B418","v":0},{"$f":"IMPRIMIR!C418","v":0},{"$f":"IF(E419=0,0,IMPRIMIR!D418)","v":0},{"$f":"IF(E419=0,0,IMPRIMIR!E418)","v":0},0,0,0]
[null,{"$f":"IF(E420=0,0,IMPRIMIR!A419)","v":0},{"$f":"IF(E420=0,0,IMPRIMIR!$D$3)","v":0},0,{"$f":"IMPRIMIR!B419","v":0},{"$f":"IMPRIMIR!C419","v":0},{"$f":"IF(E420=0,0,IMPRIMIR!D419)","v":0},{"$f":"IF(E420=0,0,IMPRIMIR!E419)","v":0},0,0,0]
[null,{"$f":"IF(E421=0,0,IMPRIMIR!A420)","v":0},{"$f":"IF(E421=0,0,IMPRIMIR!$D$3)","v":0},0,{"$f":"IMPRIMIR!B420","v":0},{"$f":"IMPRIMIR!C420","v":0},{"$f":"IF(E421=0,0,IMPRIMIR!D420)","v":0},{"$f":"IF(E421=0,0,IMPRIMIR!E420)","v":0},0,0,0]
[null,{"$f":"IF(E422=0,0,IMPRIMIR!A421)","v":0},{"$f":"IF(E422=0,0,IMPRIMIR!$D$3)","v":0},{"$f":"IF(E422=\"0\",0,$G$2)","v":0},{"$f":"IMPRIMIR!B421","v":0},{"$f":"IMPRIMIR!C421","v":0},{"$f":"IF(E422=0,0,IMPRIMIR!D421)","v":0},{"$f":"IF(E422=0,0,IMPRIMIR!E421)","v":0},{"$f":"IF(E422=0,0,$G$2)","v":0},{"$f":"IF(E422=0,0,$G$4)","v":0},{"$f":"IF(E422=0,0,$G$3)","v":0}]
[null,{"$f":"IF(E423=0,0,IMPRIMIR!A422)","v":0},{"$f":"IF(E423=0,0,IMPRIMIR!$D$3)","v":0},0,{"$f":"IMPRIMIR!B422","v":0},{"$f":"IMPRIMIR!C422","v":0},{"$f":"IF(E423=0,0,IMPRIMIR!D422)","v":0},{"$f":"IF(E423=0,0,IMPRIMIR!E422)","v":0},0,0,0]
[null,{"$f":"IF(E424=0,0,IMPRIMIR!A423)","v":0},{"$f":"IF(E424=0,0,IMPRIMIR!$D$3)","v":0},0,{"$f":"IMPRIMIR!B423","v":0},{"$f":"IMPRIMIR!C423","v":0},{"$f":"IF(E424=0,0,IMPRIMIR!D423)","v":0},{"$f":"IF(E424=0,0,IMPRIMIR!E423)","v":0},0,0,0]
[null,{"$f":"IF(E425=0,0,IMPRIMIR!A424)","v":0},{"$f":"IF(E425=0,0,IMPRIMIR!$D$3)","v":0},0,{"$f":"IMPRIMIR!B424","v":0},{"$f":"IMPRIMIR!C424","v":0},{"$f":"IF(E425=0,0,IMPRIMIR!D424)","v":0},{"$f":"IF(E425=0,0,IMPRIMIR!E424)","v":0},0,0,0]
[null,{"$f":"IF(E426=0,0,IMPRIMIR!A425)","v":0},{"$f":"IF(E426=0,0,IMPRIMIR!$D$3)","v":0},0,{"$f":"IMPRIMIR!B425","v":0},{"$f":"IMPRIMIR!C425","v":0},{"$f":"IF(E426=0,0,IMPRIMIR!D425)","v":0},{"$f":"IF(E426=0,0,IMPRIMIR!E425)","v":0},0,0,0]
[null,{"$f":"IF(E427=0,0,IMPRIMIR!A426)","v":0},{"$f":"IF(E427=0,0,IMPRIMIR!$D$3)","v":0},0,{"$f":"IMPRIMIR!B426","v":0},{"$f":"IMPRIMIR!C426","v":0},{"$f":"IF(E427=0,0,IMPRIMIR!D426)","v":0},{"$f":"IF(E427=0,0,IMPRIMIR!E426)","v":0},0,0,0]
[null,{"$f":"IF(E428=0,0,IMPRIMIR!A427)","v":0},{"$f":"IF(E428=0,0,IMPRIMIR!$D$3)","v":0},0,{"$f":"IMPRIMIR!B427","v":0},{"$f":"IMPRIMIR!C427","v":0},{"$f":"IF(E428=0,0,IMPRIMIR!D427)","v":0},{"$f":"IF(E428=0,0,IMPRIMIR!E427)","v":0},0,0,0]
[null,{"$f":"IF(E429=0,0,IMPRIMIR!A428)","v":0},{"$f":"IF(E429=0,0,IMPRIMIR!$D$3)","v":0},0,{"$f":"IMPRIMIR!B428","v":0},{"$f":"IMPRIMIR!C428","v":0},{"$f":"IF(E429=0,0,IMPRIMIR!D428)","v":0},{"$f":"IF(E429=0,0,IMPRIMIR!E428)","v":0},0,0,0]
[null,{"$f":"IF(E430=0,0,IMPRIMIR!A429)","v":0},{"$f":"IF(E430=0,0,IMPRIMIR!$D$3)","v":0},0,{"$f":"IMPRIMIR!B429","v":0},{"$f":"IMPRIMIR!C429","v":0},{"$f":"IF(E430=0,0,IMPRIMIR!D429)","v":0},{"$f":"IF(E430=0,0,IMPRIMIR!E429)","v":0},0,0,0]
[null,{"$f":"IF(E431=0,0,IMPRIMIR!A430)","v":0},{"$f":"IF(E431=0,0,IMPRIMIR!$D$3)","v":0},0,{"$f":"IMPRIMIR!B430","v":0},{"$f":"IMPRIMIR!C430","v":0},{"$f":"IF(E431=0,0,IMPRIMIR!D430)","v":0},{"$f":"IF(E431=0,0,IMPRIMIR!E430)","v":0},0,0,0]
[null,{"$f":"IF(E432=0,0,IMPRIMIR!A431)","v":0},{"$f":"IF(E432=0,0,IMPRIMIR!$D$3)","v":0},0,{"$f":"IMPRIMIR!B431","v":0},{"$f":"IMPRIMIR!C431","v":0},{"$f":"IF(E432=0,0,IMPRIMIR!D431)","v":0},{"$f":"IF(E432=0,0,IMPRIMIR!E431)","v":0},0,0,0]
[null,{"$f":"IF(E433=0,0,IMPRIMIR!A432)","v":0},{"$f":"IF(E433=0,0,IMPRIMIR!$D$3)","v":0},0,{"$f":"IMPRIMIR!B432","v":0},{"$f":"IMPRIMIR!C432","v":0},{"$f":"IF(E433=0,0,IMPRIMIR!D432)","v":0},{"$f":"IF(E433=0,0,IMPRIMIR!E432)","v":0},0,0,0]
[null,{"$f":"IF(E434=0,0,IMPRIMIR!A433)","v":0},{"$f":"IF(E434=0,0,IMPRIMIR!$D$3)","v":0},0,{"$f":"IMPRIMIR!B433","v":0},{"$f":"IMPRIMIR!C433","v":0},{"$f":"IF(E434=0,0,IMPRIMIR!D433)","v":0},{"$f":"IF(E434=0,0,IMPRIMIR!E433)","v":0},0,0,0]
[null,{"$f":"IF(E435=0,0,IMPRIMIR!A434)","v":0},{"$f":"IF(E435=0,0,IMPRIMIR!$D$3)","v":0},0,{"$f":"IMPRIMIR!B434","v":0},{"$f":"IMPRIMIR!C434","v":0},{"$f":"IF(E435=0,0,IMPRIMIR!D434)","v":0},{"$f":"IF(E435=0,0,IMPRIMIR!E434)","v":0},0,0,0]
[null,{"$f":"IF(E436=0,0,IMPRIMIR!A435)","v":0},{"$f":"IF(E436=0,0,IMPRIMIR!$D$3)","v":0},0,{"$f":"IMPRIMIR!B435","v":0},{"$f":"IMPRIMIR!C435","v":0},{"$f":"IF(E436=0,0,IMPRIMIR!D435)","v":0},{"$f":"IF(E436=0,0,IMPRIMIR!E435)","v":0},0,0,0]
[null,{"$f":"IF(E437=0,0,IMPRIMIR!A436)","v":0},{"$f":"IF(E437=0,0,IMPRIMIR!$D$3)","v":0},0,{"$f":"IMPRIMIR!B436","v":0},{"$f":"IMPRIMIR!C436","v":0},{"$f":"IF(E437=0,0,IMPRIMIR!D436)","v":0},{"$f":"IF(E437=0,0,IMPRIMIR!E436)","v":0},0,0,0]
[null,{"$f":"IF(E438=0,0,IMPRIMIR!A437)","v":0},{"$f":"IF(E438=0,0,IMPRIMIR!$D$3)","v":0},0,{"$f":"IMPRIMIR!B437","v":0},{"$f":"IMPRIMIR!C437","v":0},{"$f":"IF(E438=0,0,IMPRIMIR!D437)","v":0},{"$f":"IF(E438=0,0,IMPRIMIR!E437)","v":0},0,0,0]
[null,{"$f":"IF(E439=0,0,IMPRIMIR!A438)","v":0},{"$f":"IF(E439=0,0,IMPRIMIR!$D$3)","v":0},0,{"$f":"IMPRIMIR!B438","v":0},{"$f":"IMPRIMIR!C438","v":0},{"$f":"IF(E439=0,0,IMPRIMIR!D438)","v":0},{"$f":"IF(E439=0,0,IMPRIMIR!E438)","v":0},0,0,0]
[null,{"$f":"IF(E440=0,0,IMPRIMIR!A439)","v":0},{"$f":"IF(E440=0,0,IMPRIMIR!$D$3)","v":0},0,{"$f":"IMPRIMIR!B439","v":0},{"$f":"IMPRIMIR!C439","v":0},{"$f":"IF(E440=0,0,IMPRIMIR!D439)","v":0},{"$f":"IF(E440=0,0,IMPRIMIR!E439)","v":0},0,0,0]
[null,{"$f":"IF(E441=0,0,IMPRIMIR!A440)","v":0},{"$f":"IF(E441=0,0,IMPRIMIR!$D$3)","v":0},0,{"$f":"IMPRIMIR!B440","v":0},{"$f":"IMPRIMIR!C440","v":0},{"$f":"IF(E441=0,0,IMPRIMIR!D440)","v":0},{"$f":"IF(E441=0,0,IMPRIMIR!E440)","v":0},0,0,0]
[null,{"$f":"IF(E442=0,0,IMPRIMIR!A441)","v":0},{"$f":"IF(E442=0,0,IMPRIMIR!$D$3)","v":0},0,{"$f":"IMPRIMIR!B441","v":0},{"$f":"IMPRIMIR!C441","v":0},{"$f":"IF(E442=0,0,IMPRIMIR!D441)","v":0},{"$f":"IF(E442=0,0,IMPRIMIR!E441)","v":0},0,0,0]
[null,{"$f":"IF(E443=0,0,IMPRIMIR!A442)","v":0},{"$f":"IF(E443=0,0,IMPRIMIR!$D$3)","v":0},0,{"$f":"IMPRIMIR!B442","v":0},{"$f":"IMPRIMIR!C442","v":0},{"$f":"IF(E443=0,0,IMPRIMIR!D442)","v":0},{"$f":"IF(E443=0,0,IMPRIMIR!E442)","v":0},0,0,0]
[null,{"$f":"IF(E444=0,0,IMPRIMIR!A443)","v":0},{"$f":"IF(E444=0,0,IMPRIMIR!$D$3)","v":0},0,{"$f":"IMPRIMIR!B443","v":0},{"$f":"IMPRIMIR!C443","v":0},{"$f":"IF(E444=0,0,IMPRIMIR!D443)","v":0},{"$f":"IF(E444=0,0,IMPRIMIR!E443)","v":0},0,0,0]
[null,{"$f":"IF(E445=0,0,IMPRIMIR!A444)","v":0},{"$f":"IF(E445=0,0,IMPRIMIR!$D$3)","v":0},0,{"$f":"IMPRIMIR!B444","v":0},{"$f":"IMPRIMIR!C444","v":0},{"$f":"IF(E445=0,0,IMPRIMIR!D444)","v":0},{"$f":"IF(E445=0,0,IMPRIMIR!E444)","v":0},0,0,0]
[null,{"$f":"IF(E446=0,0,IMPRIMIR!A445)","v":0},{"$f":"IF(E446=0,0,IMPRIMIR!$D$3)","v":0},0,{"$f":"IMPRIMIR!B445","v":0},{"$f":"IMPRIMIR!C445","v":0},{"$f":"IF(E446=0,0,IMPRIMIR!D445)","v":0},{"$f":"IF(E446=0,0,IMPRIMIR!E445)","v":0},0,0,0]
[null,{"$f":"IF(E447=0,0,IMPRIMIR!A446)","v":0},{"$f":"IF(E447=0,0,IMPRIMIR!$D$3)","v":0},0,{"$f":"IMPRIMIR!B446","v":0},{"$f":"IMPRIMIR!C446","v":0},{"$f":"IF(E447=0,0,IMPRIMIR!D446)","v":0},{"$f":"IF(E447=0,0,IMPRIMIR!E446)","v":0},0,0,0]
[null,{"$f":"IF(E448=0,0,IMPRIMIR!A447)","v":0},{"$f":"IF(E448=0,0,IMPRIMIR!$D$3)","v":0},0,{"$f":"IMPRIMIR!B447","v":0},{"$f":"IMPRIMIR!C447","v":0},{"$f":"IF(E448=0,0,IMPRIMIR!D447)","v":0},{"$f":"IF(E448=0,0,IMPRIMIR!E447)","v":0},0,0,0]
[null,{"$f":"IF(E449=0,0,IMPRIMIR!A448)","v":0},{"$f":"IF(E449=0,0,IMPRIMIR!$D$3)","v":0},0,{"$f":"IMPRIMIR!B448","v":0},{"$f":"IMPRIMIR!C448","v":0},{"$f":"IF(E449=0,0,IMPRIMIR!D448)","v":0},{"$f":"IF(E449=0,0,IMPRIMIR!E448)","v":0},0,0,0]
[null,{"$f":"IF(E450=0,0,IMPRIMIR!A449)","v":0},{"$f":"IF(E450=0,0,IMPRIMIR!$D$3)","v":0},0,{"$f":"IMPRIMIR!B449","v":0},{"$f":"IMPRIMIR!C449","v":0},{"$f":"IF(E450=0,0,IMPRIMIR!D449)","v":0},{"$f":"IF(E450=0,0,IMPRIMIR!E449)","v":0},0,0,0]
[null,{"$f":"IF(E451=0,0,IMPRIMIR!A450)","v":0},{"$f":"IF(E451=0,0,IMPRIMIR!$D$3)","v":0},0,{"$f":"IMPRIMIR!B450","v":0},{"$f":"IMPRIMIR!C450","v":0},{"$f":"IF(E451=0,0,IMPRIMIR!D450)","v":0},{"$f":"IF(E451=0,0,IMPRIMIR!E450)","v":0},0,0,0]
[null,{"$f":"IF(E452=0,0,IMPRIMIR!A451)","v":0},{"$f":"IF(E452=0,0,IMPRIMIR!$D$3)","v":0},0,{"$f":"IMPRIMIR!B451","v":0},{"$f":"IMPRIMIR!C451","v":0},{"$f":"IF(E452=0,0,IMPRIMIR!D451)","v":0},{"$f":"IF(E452=0,0,IMPRIMIR!E451)","v":0},0,0,0]
[null,{"$f":"IF(E453=0,0,IMPRIMIR!A452)","v":0},{"$f":"IF(E453=0,0,IMPRIMIR!$D$3)","v":0},0,{"$f":"IMPRIMIR!B452","v":0},{"$f":"IMPRIMIR!C452","v":0},{"$f":"IF(E453=0,0,IMPRIMIR!D452)","v":0},{"$f":"IF(E453=0,0,IMPRIMIR!E452)","v":0},0,0,0]
[null,{"$f":"IF(E454=0,0,IMPRIMIR!A453)","v":0},{"$f":"IF(E454=0,0,IMPRIMIR!$D$3)","v":0},0,{"$f":"IMPRIMIR!B453","v":0},{"$f":"IMPRIMIR!C453","v":0},{"$f":"IF(E454=0,0,IMPRIMIR!D453)","v":0},{"$f":"IF(E454=0,0,IMPRIMIR!E453)","v":0},0,0,0]
[null,{"$f":"IF(E455=0,0,IMPRIMIR!A454)","v":0},{"$f":"IF(E455=0,0,IMPRIMIR!$D$3)","v":0},0,{"$f":"IMPRIMIR!B454","v":0},{"$f":"IMPRIMIR!C454","v":0},{"$f":"IF(E455=0,0,IMPRIMIR!D454)","v":0},{"$f":"IF(E455=0,0,IMPRIMIR!E454)","v":0},0,0,0]
[null,{"$f":"IF(E456=0,0,IMPRIMIR!A455)","v":0},{"$f":"IF(E456=0,0,IMPRIMIR!$D$3)","v":0},0,{"$f":"IMPRIMIR!B455","v":0},{"$f":"IMPRIMIR!C455","v":0},{"$f":"IF(E456=0,0,IMPRIMIR!D455)","v":0},{"$f":"IF(E456=0,0,IMPRIMIR!E455)","v":0},0,0,0]
[null,{"$f":"IF(E457=0,0,IMPRIMIR!A456)","v":0},{"$f":"IF(E457=0,0,IMPRIMIR!$D$3)","v":0},0,{"$f":"IMPRIMIR!B456","v":0},{"$f":"IMPRIMIR!C456","v":0},{"$f":"IF(E457=0,0,IMPRIMIR!D456)","v":0},{"$f":"IF(E457=0,0,IMPRIMIR!E456)","v":0},0,0,0]
[null,{"$f":"IF(E458=0,0,IMPRIMIR!A457)","v":0},{"$f":"IF(E458=0,0,IMPRIMIR!$D$3)","v":0},0,{"$f":"IMPRIMIR!B457","v":0},{"$f":"IMPRIMIR!C457","v":0},{"$f":"IF(E458=0,0,IMPRIMIR!D457)","v":0},{"$f":"IF(E458=0,0,IMPRIMIR!E457)","v":0},0,0,0]
[null,{"$f":"IF(E459=0,0,IMPRIMIR!A458)","v":0},{"$f":"IF(E459=0,0,IMPRIMIR!$D$3)","v":0},0,{"$f":"IMPRIMIR!B458","v":0},{"$f":"IMPRIMIR!C458","v":0},{"$f":"IF(E459=0,0,IMPRIMIR!D458)","v":0},{"$f":"IF(E459=0,0,IMPRIMIR!E458)","v":0},0,0,0]
[null,{"$f":"IF(E460=0,0,IMPRIMIR!A459)","v":0},{"$f":"IF(E460=0,0,IMPRIMIR!$D$3)","v":0},0,{"$f":"IMPRIMIR!B459","v":0},{"$f":"IMPRIMIR!C459","v":0},{"$f":"IF(E460=0,0,IMPRIMIR!D459)","v":0},{"$f":"IF(E460=0,0,IMPRIMIR!E459)","v":0},0,0,0]
[null,{"$f":"IF(E461=0,0,IMPRIMIR!A460)","v":0},{"$f":"IF(E461=0,0,IMPRIMIR!$D$3)","v":0},0,{"$f":"IMPRIMIR!B460","v":0},{"$f":"IMPRIMIR!C460","v":0},{"$f":"IF(E461=0,0,IMPRIMIR!D460)","v":0},{"$f":"IF(E461=0,0,IMPRIMIR!E460)","v":0},0,0,0]
[null,{"$f":"IF(E462=0,0,IMPRIMIR!A461)","v":0},{"$f":"IF(E462=0,0,IMPRIMIR!$D$3)","v":0},0,{"$f":"IMPRIMIR!B461","v":0},{"$f":"IMPRIMIR!C461","v":0},{"$f":"IF(E462=0,0,IMPRIMIR!D461)","v":0},{"$f":"IF(E462=0,0,IMPRIMIR!E461)","v":0},0,0,0]
[null,{"$f":"IF(E463=0,0,IMPRIMIR!A462)","v":0},{"$f":"IF(E463=0,0,IMPRIMIR!$D$3)","v":0},0,{"$f":"IMPRIMIR!B462","v":0},{"$f":"IMPRIMIR!C462","v":0},{"$f":"IF(E463=0,0,IMPRIMIR!D462)","v":0},{"$f":"IF(E463=0,0,IMPRIMIR!E462)","v":0},0,0,0]
[null,{"$f":"IF(E464=0,0,IMPRIMIR!A463)","v":0},{"$f":"IF(E464=0,0,IMPRIMIR!$D$3)","v":0},0,{"$f":"IMPRIMIR!B463","v":0},{"$f":"IMPRIMIR!C463","v":0},{"$f":"IF(E464=0,0,IMPRIMIR!D463)","v":0},{"$f":"IF(E464=0,0,IMPRIMIR!E463)","v":0},0,0,0]
[null,{"$f":"IF(E465=0,0,IMPRIMIR!A464)","v":0},{"$f":"IF(E465=0,0,IMPRIMIR!$D$3)","v":0},0,{"$f":"IMPRIMIR!B464","v":0},{"$f":"IMPRIMIR!C464","v":0},{"$f":"IF(E465=0,0,IMPRIMIR!D464)","v":0},{"$f":"IF(E465=0,0,IMPRIMIR!E464)","v":0},0,0,0]
[null,{"$f":"IF(E466=0,0,IMPRIMIR!A465)","v":0},{"$f":"IF(E466=0,0,IMPRIMIR!$D$3)","v":0},0,{"$f":"IMPRIMIR!B465","v":0},{"$f":"IMPRIMIR!C465","v":0},{"$f":"IF(E466=0,0,IMPRIMIR!D465)","v":0},{"$f":"IF(E466=0,0,IMPRIMIR!E465)","v":0},0,0,0]
[null,{"$f":"IF(E467=0,0,IMPRIMIR!A466)","v":0},{"$f":"IF(E467=0,0,IMPRIMIR!$D$3)","v":0},0,{"$f":"IMPRIMIR!B466","v":0},{"$f":"IMPRIMIR!C466","v":0},{"$f":"IF(E467=0,0,IMPRIMIR!D466)","v":0},{"$f":"IF(E467=0,0,IMPRIMIR!E466)","v":0},0,0,0]
[null,{"$f":"IF(E468=0,0,IMPRIMIR!A467)","v":0},{"$f":"IF(E468=0,0,IMPRIMIR!$D$3)","v":0},0,{"$f":"IMPRIMIR!B467","v":0},{"$f":"IMPRIMIR!C467","v":0},{"$f":"IF(E468=0,0,IMPRIMIR!D467)","v":0},{"$f":"IF(E468=0,0,IMPRIMIR!E467)","v":0},0,0,0]
[null,{"$f":"IF(E469=0,0,IMPRIMIR!A468)","v":0},{"$f":"IF(E469=0,0,IMPRIMIR!$D$3)","v":0},0,{"$f":"IMPRIMIR!B468","v":0},{"$f":"IMPRIMIR!C468","v":0},{"$f":"IF(E469=0,0,IMPRIMIR!D468)","v":0},{"$f":"IF(E469=0,0,IMPRIMIR!E468)","v":0},0,0,0]
[null,{"$f":"IF(E470=0,0,IMPRIMIR!A469)","v":0},{"$f":"IF(E470=0,0,IMPRIMIR!$D$3)","v":0},0,{"$f":"IMPRIMIR!B469","v":0},{"$f":"IMPRIMIR!C469","v":0},{"$f":"IF(E470=0,0,IMPRIMIR!D469)","v":0},{"$f":"IF(E470=0,0,IMPRIMIR!E469)","v":0},0,0,0]
[null,{"$f":"IF(E471=0,0,IMPRIMIR!A470)","v":0},{"$f":"IF(E471=0,0,IMPRIMIR!$D$3)","v":0},0,{"$f":"IMPRIMIR!B470","v":0},{"$f":"IMPRIMIR!C470","v":0},{"$f":"IF(E471=0,0,IMPRIMIR!D470)","v":0},{"$f":"IF(E471=0,0,IMPRIMIR!E470)","v":0},0,0,0]
[null,{"$f":"IF(E472=0,0,IMPRIMIR!A471)","v":0},{"$f":"IF(E472=0,0,IMPRIMIR!$D$3)","v":0},0,{"$f":"IMPRIMIR!B471","v":0},{"$f":"IMPRIMIR!C471","v":0},{"$f":"IF(E472=0,0,IMPRIMIR!D471)","v":0},{"$f":"IF(E472=0,0,IMPRIMIR!E471)","v":0},0,0,0]
[null,{"$f":"IF(E473=0,0,IMPRIMIR!A472)","v":0},{"$f":"IF(E473=0,0,IMPRIMIR!$D$3)","v":0},0,{"$f":"IMPRIMIR!B472","v":0},{"$f":"IMPRIMIR!C472","v":0},{"$f":"IF(E473=0,0,IMPRIMIR!D472)","v":0},{"$f":"IF(E473=0,0,IMPRIMIR!E472)","v":0},0,0,0]
[null,{"$f":"IF(E474=0,0,IMPRIMIR!A473)","v":0},{"$f":"IF(E474=0,0,IMPRIMIR!$D$3)","v":0},0,{"$f":"IMPRIMIR!B473","v":0},{"$f":"IMPRIMIR!C473","v":0},{"$f":"IF(E474=0,0,IMPRIMIR!D473)","v":0},{"$f":"IF(E474=0,0,IMPRIMIR!E473)","v":0},0,0,0]
[null,{"$f":"IF(E475=0,0,IMPRIMIR!A474)","v":0},{"$f":"IF(E475=0,0,IMPRIMIR!$D$3)","v":0},0,{"$f":"IMPRIMIR!B474","v":0},{"$f":"IMPRIMIR!C474","v":0},{"$f":"IF(E475=0,0,IMPRIMIR!D474)","v":0},{"$f":"IF(E475=0,0,IMPRIMIR!E474)","v":0},0,0,0]
[null,{"$f":"IF(E476=0,0,IMPRIMIR!A475)","v":0},{"$f":"IF(E476=0,0,IMPRIMIR!$D$3)","v":0},0,{"$f":"IMPRIMIR!B475","v":0},{"$f":"IMPRIMIR!C475","v":0},{"$f":"IF(E476=0,0,IMPRIMIR!D475)","v":0},{"$f":"IF(E476=0,0,IMPRIMIR!E475)","v":0},0,0,0]
[null,{"$f":"IF(E477=0,0,IMPRIMIR!A476)","v":0},{"$f":"IF(E477=0,0,IMPRIMIR!$D$3)","v":0},0,{"$f":"IMPRIMIR!B476","v":0},{"$f":"IMPRIMIR!C476","v":0},{"$f":"IF(E477=0,0,IMPRIMIR!D476)","v":0},{"$f":"IF(E477=0,0,IMPRIMIR!E476)","v":0},0,0,0]
[null,{"$f":"IF(E478=0,0,IMPRIMIR!A477)","v":0},{"$f":"IF(E478=0,0,IMPRIMIR!$D$3)","v":0},0,{"$f":"IMPRIMIR!B477","v":0},{"$f":"IMPRIMIR!C477","v":0},{"$f":"IF(E478=0,0,IMPRIMIR!D477)","v":0},{"$f":"IF(E478=0,0,IMPRIMIR!E477)","v":0},0,0,0]
[null,{"$f":"IF(E479=0,0,IMPRIMIR!A478)","v":0},{"$f":"IF(E479=0,0,IMPRIMIR!$D$3)","v":0},0,{"$f":"IMPRIMIR!B478","v":0},{"$f":"IMPRIMIR!C478","v":0},{"$f":"IF(E479=0,0,IMPRIMIR!D478)","v":0},{"$f":"IF(E479=0,0,IMPRIMIR!E478)","v":0},0,0,0]
[null,{"$f":"IF(E480=0,0,IMPRIMIR!A479)","v":0},{"$f":"IF(E480=0,0,IMPRIMIR!$D$3)","v":0},0,{"$f":"IMPRIMIR!B479","v":0},{"$f":"IMPRIMIR!C479","v":0},{"$f":"IF(E480=0,0,IMPRIMIR!D479)","v":0},{"$f":"IF(E480=0,0,IMPRIMIR!E479)","v":0},0,0,0]
[null,{"$f":"IF(E481=0,0,IMPRIMIR!A480)","v":0},{"$f":"IF(E481=0,0,IMPRIMIR!$D$3)","v":0},0,{"$f":"IMPRIMIR!B480","v":0},{"$f":"IMPRIMIR!C480","v":0},{"$f":"IF(E481=0,0,IMPRIMIR!D480)","v":0},{"$f":"IF(E481=0,0,IMPRIMIR!E480)","v":0},0,0,0]
[null,{"$f":"IF(E482=0,0,IMPRIMIR!A481)","v":0},{"$f":"IF(E482=0,0,IMPRIMIR!$D$3)","v":0},0,{"$f":"IMPRIMIR!B481","v":0},{"$f":"IMPRIMIR!C481","v":0},{"$f":"IF(E482=0,0,IMPRIMIR!D481)","v":0},{"$f":"IF(E482=0,0,IMPRIMIR!E481)","v":0},0,0,0]
[null,{"$f":"IF(E483=0,0,IMPRIMIR!A482)","v":0},{"$f":"IF(E483=0,0,IMPRIMIR!$D$3)","v":0},0,{"$f":"IMPRIMIR!B482","v":0},{"$f":"IMPRIMIR!C482","v":0},{"$f":"IF(E483=0,0,IMPRIMIR!D482)","v":0},{"$f":"IF(E483=0,0,IMPRIMIR!E482)","v":0},0,0,0]
[null,{"$f":"IF(E484=0,0,IMPRIMIR!A483)","v":0},{"$f":"IF(E484=0,0,IMPRIMIR!$D$3)","v":0},0,{"$f":"IMPRIMIR!B483","v":0},{"$f":"IMPRIMIR!C483","v":0},{"$f":"IF(E484=0,0,IMPRIMIR!D483)","v":0},{"$f":"IF(E484=0,0,IMPRIMIR!E483)","v":0},0,0,0]
[null,{"$f":"IF(E485=0,0,IMPRIMIR!A484)","v":0},{"$f":"IF(E485=0,0,IMPRIMIR!$D$3)","v":0},0,{"$f":"IMPRIMIR!B484","v":0},{"$f":"IMPRIMIR!C484","v":0},{"$f":"IF(E485=0,0,IMPRIMIR!D484)","v":0},{"$f":"IF(E485=0,0,IMPRIMIR!E484)","v":0},0,0,0]
[null,{"$f":"IF(E486=0,0,IMPRIMIR!A485)","v":0},{"$f":"IF(E486=0,0,IMPRIMIR!$D$3)","v":0},{"$f":"IF(E486=\"0\",0,$G$2)","v":0},{"$f":"IMPRIMIR!B485","v":0},{"$f":"IMPRIMIR!C485","v":0},{"$f":"IF(E486=0,0,IMPRIMIR!D485)","v":0},{"$f":"IF(E486=0,0,IMPRIMIR!E485)","v":0},{"$f":"IF(E486=0,0,$G$2)","v":0},{"$f":"IF(E486=0,0,$G$4)","v":0},{"$f":"IF(E486=0,0,$G$3)","v":0}]
[null,{"$f":"IF(E487=0,0,IMPRIMIR!A486)","v":0},{"$f":"IF(E487=0,0,IMPRIMIR!$D$3)","v":0},0,{"$f":"IMPRIMIR!B486","v":0},{"$f":"IMPRIMIR!C486","v":0},{"$f":"IF(E487=0,0,IMPRIMIR!D486)","v":0},{"$f":"IF(E487=0,0,IMPRIMIR!E486)","v":0},0,0,0]
[null,{"$f":"IF(E488=0,0,IMPRIMIR!A487)","v":0},{"$f":"IF(E488=0,0,IMPRIMIR!$D$3)","v":0},0,{"$f":"IMPRIMIR!B487","v":0},{"$f":"IMPRIMIR!C487","v":0},{"$f":"IF(E488=0,0,IMPRIMIR!D487)","v":0},{"$f":"IF(E488=0,0,IMPRIMIR!E487)","v":0},0,0,0]
[null,{"$f":"IF(E489=0,0,IMPRIMIR!A488)","v":0},{"$f":"IF(E489=0,0,IMPRIMIR!$D$3)","v":0},0,{"$f":"IMPRIMIR!B488","v":0},{"$f":"IMPRIMIR!C488","v":0},{"$f":"IF(E489=0,0,IMPRIMIR!D488)","v":0},{"$f":"IF(E489=0,0,IMPRIMIR!E488)","v":0},0,0,0]
[null,{"$f":"IF(E490=0,0,IMPRIMIR!A489)","v":0},{"$f":"IF(E490=0,0,IMPRIMIR!$D$3)","v":0},0,{"$f":"IMPRIMIR!B489","v":0},{"$f":"IMPRIMIR!C489","v":0},{"$f":"IF(E490=0,0,IMPRIMIR!D489)","v":0},{"$f":"IF(E490=0,0,IMPRIMIR!E489)","v":0},0,0,0]
[null,{"$f":"IF(E491=0,0,IMPRIMIR!A490)","v":0},{"$f":"IF(E491=0,0,IMPRIMIR!$D$3)","v":0},0,{"$f":"IMPRIMIR!B490","v":0},{"$f":"IMPRIMIR!C490","v":0},{"$f":"IF(E491=0,0,IMPRIMIR!D490)","v":0},{"$f":"IF(E491=0,0,IMPRIMIR!E490)","v":0},0,0,0]
[null,{"$f":"IF(E492=0,0,IMPRIMIR!A491)","v":0},{"$f":"IF(E492=0,0,IMPRIMIR!$D$3)","v":0},0,{"$f":"IMPRIMIR!B491","v":0},{"$f":"IMPRIMIR!C491","v":0},{"$f":"IF(E492=0,0,IMPRIMIR!D491)","v":0},{"$f":"IF(E492=0,0,IMPRIMIR!E491)","v":0},0,0,0]
[null,{"$f":"IF(E493=0,0,IMPRIMIR!A492)","v":0},{"$f":"IF(E493=0,0,IMPRIMIR!$D$3)","v":0},0,{"$f":"IMPRIMIR!B492","v":0},{"$f":"IMPRIMIR!C492","v":0},{"$f":"IF(E493=0,0,IMPRIMIR!D492)","v":0},{"$f":"IF(E493=0,0,IMPRIMIR!E492)","v":0},0,0,0]
[null,{"$f":"IF(E494=0,0,IMPRIMIR!A493)","v":0},{"$f":"IF(E494=0,0,IMPRIMIR!$D$3)","v":0},0,{"$f":"IMPRIMIR!B493","v":0},{"$f":"IMPRIMIR!C493","v":0},{"$f":"IF(E494=0,0,IMPRIMIR!D493)","v":0},{"$f":"IF(E494=0,0,IMPRIMIR!E493)","v":0},0,0,0]
[null,{"$f":"IF(E495=0,0,IMPRIMIR!A494)","v":0},{"$f":"IF(E495=0,0,IMPRIMIR!$D$3)","v":0},0,{"$f":"IMPRIMIR!B494","v":0},{"$f":"IMPRIMIR!C494","v":0},{"$f":"IF(E495=0,0,IMPRIMIR!D494)","v":0},{"$f":"IF(E495=0,0,IMPRIMIR!E494)","v":0},0,0,0]
[null,{"$f":"IF(E496=0,0,IMPRIMIR!A495)","v":0},{"$f":"IF(E496=0,0,IMPRIMIR!$D$3)","v":0},0,{"$f":"IMPRIMIR!B495","v":0},{"$f":"IMPRIMIR!C495","v":0},{"$f":"IF(E496=0,0,IMPRIMIR!D495)","v":0},{"$f":"IF(E496=0,0,IMPRIMIR!E495)","v":0},0,0,0]
[null,{"$f":"IF(E497=0,0,IMPRIMIR!A496)","v":0},{"$f":"IF(E497=0,0,IMPRIMIR!$D$3)","v":0},0,{"$f":"IMPRIMIR!B496","v":0},{"$f":"IMPRIMIR!C496","v":0},{"$f":"IF(E497=0,0,IMPRIMIR!D496)","v":0},{"$f":"IF(E497=0,0,IMPRIMIR!E496)","v":0},0,0,0]
[null,{"$f":"IF(E498=0,0,IMPRIMIR!A497)","v":0},{"$f":"IF(E498=0,0,IMPRIMIR!$D$3)","v":0},0,{"$f":"IMPRIMIR!B497","v":0},{"$f":"IMPRIMIR!C497","v":0},{"$f":"IF(E498=0,0,IMPRIMIR!D497)","v":0},{"$f":"IF(E498=0,0,IMPRIMIR!E497)","v":0},0,0,0]
[null,{"$f":"IF(E499=0,0,IMPRIMIR!A498)","v":0},{"$f":"IF(E499=0,0,IMPRIMIR!$D$3)","v":0},0,{"$f":"IMPRIMIR!B498","v":0},{"$f":"IMPRIMIR!C498","v":0},{"$f":"IF(E499=0,0,IMPRIMIR!D498)","v":0},{"$f":"IF(E499=0,0,IMPRIMIR!E498)","v":0},0,0,0]
[null,{"$f":"IF(E500=0,0,IMPRIMIR!A499)","v":0},{"$f":"IF(E500=0,0,IMPRIMIR!$D$3)","v":0},0,{"$f":"IMPRIMIR!B499","v":0},{"$f":"IMPRIMIR!C499","v":0},{"$f":"IF(E500=0,0,IMPRIMIR!D499)","v":0},{"$f":"IF(E500=0,0,IMPRIMIR!E499)","v":0},0,0,0]
[null,{"$f":"IF(E501=0,0,IMPRIMIR!A500)","v":0},{"$f":"IF(E501=0,0,IMPRIMIR!$D$3)","v":0},0,{"$f":"IMPRIMIR!B500","v":0},{"$f":"IMPRIMIR!C500","v":0},{"$f":"IF(E501=0,0,IMPRIMIR!D500)","v":0},{"$f":"IF(E501=0,0,IMPRIMIR!E500)","v":0},0,0,0]
[null,{"$f":"IF(E502=0,0,IMPRIMIR!A501)","v":0},{"$f":"IF(E502=0,0,IMPRIMIR!$D$3)","v":0},0,{"$f":"IMPRIMIR!B501","v":0},{"$f":"IMPRIMIR!C501","v":0},{"$f":"IF(E502=0,0,IMPRIMIR!D501)","v":0},{"$f":"IF(E502=0,0,IMPRIMIR!E501)","v":0},0,0,0]
[null,{"$f":"IF(E503=0,0,IMPRIMIR!A502)","v":0},{"$f":"IF(E503=0,0,IMPRIMIR!$D$3)","v":0},0,{"$f":"IMPRIMIR!B502","v":0},{"$f":"IMPRIMIR!C502","v":0},{"$f":"IF(E503=0,0,IMPRIMIR!D502)","v":0},{"$f":"IF(E503=0,0,IMPRIMIR!E502)","v":0},0,0,0]
[null,{"$f":"IF(E504=0,0,IMPRIMIR!A503)","v":0},{"$f":"IF(E504=0,0,IMPRIMIR!$D$3)","v":0},0,{"$f":"IMPRIMIR!B503","v":0},{"$f":"IMPRIMIR!C503","v":0},{"$f":"IF(E504=0,0,IMPRIMIR!D503)","v":0},{"$f":"IF(E504=0,0,IMPRIMIR!E503)","v":0},0,0,0]
[null,{"$f":"IF(E505=0,0,IMPRIMIR!A504)","v":0},{"$f":"IF(E505=0,0,IMPRIMIR!$D$3)","v":0},0,{"$f":"IMPRIMIR!B504","v":0},{"$f":"IMPRIMIR!C504","v":0},{"$f":"IF(E505=0,0,IMPRIMIR!D504)","v":0},{"$f":"IF(E505=0,0,IMPRIMIR!E504)","v":0},0,0,0]
[null,{"$f":"IF(E506=0,0,IMPRIMIR!A505)","v":0},{"$f":"IF(E506=0,0,IMPRIMIR!$D$3)","v":0},0,{"$f":"IMPRIMIR!B505","v":0},{"$f":"IMPRIMIR!C505","v":0},{"$f":"IF(E506=0,0,IMPRIMIR!D505)","v":0},{"$f":"IF(E506=0,0,IMPRIMIR!E505)","v":0},0,0,0]
[null,{"$f":"IF(E507=0,0,IMPRIMIR!A506)","v":0},{"$f":"IF(E507=0,0,IMPRIMIR!$D$3)","v":0},0,{"$f":"IMPRIMIR!B506","v":0},{"$f":"IMPRIMIR!C506","v":0},{"$f":"IF(E507=0,0,IMPRIMIR!D506)","v":0},{"$f":"IF(E507=0,0,IMPRIMIR!E506)","v":0},0,0,0]
[null,{"$f":"IF(E508=0,0,IMPRIMIR!A507)","v":0},{"$f":"IF(E508=0,0,IMPRIMIR!$D$3)","v":0},0,{"$f":"IMPRIMIR!B507","v":0},{"$f":"IMPRIMIR!C507","v":0},{"$f":"IF(E508=0,0,IMPRIMIR!D507)","v":0},{"$f":"IF(E508=0,0,IMPRIMIR!E507)","v":0},0,0,0]
[null,{"$f":"IF(E509=0,0,IMPRIMIR!A508)","v":0},{"$f":"IF(E509=0,0,IMPRIMIR!$D$3)","v":0},0,{"$f":"IMPRIMIR!B508","v":0},{"$f":"IMPRIMIR!C508","v":0},{"$f":"IF(E509=0,0,IMPRIMIR!D508)","v":0},{"$f":"IF(E509=0,0,IMPRIMIR!E508)","v":0},0,0,0]
[null,{"$f":"IF(E510=0,0,IMPRIMIR!A509)","v":0},{"$f":"IF(E510=0,0,IMPRIMIR!$D$3)","v":0},0,{"$f":"IMPRIMIR!B509","v":0},{"$f":"IMPRIMIR!C509","v":0},{"$f":"IF(E510=0,0,IMPRIMIR!D509)","v":0},{"$f":"IF(E510=0,0,IMPRIMIR!E509)","v":0},0,0,0]
[null,{"$f":"IF(E511=0,0,IMPRIMIR!A510)","v":0},{"$f":"IF(E511=0,0,IMPRIMIR!$D$3)","v":0},0,{"$f":"IMPRIMIR!B510","v":0},{"$f":"IMPRIMIR!C510","v":0},{"$f":"IF(E511=0,0,IMPRIMIR!D510)","v":0},{"$f":"IF(E511=0,0,IMPRIMIR!E510)","v":0},0,0,0]
[null,{"$f":"IF(E512=0,0,IMPRIMIR!A511)","v":0},{"$f":"IF(E512=0,0,IMPRIMIR!$D$3)","v":0},0,{"$f":"IMPRIMIR!B511","v":0},{"$f":"IMPRIMIR!C511","v":0},{"$f":"IF(E512=0,0,IMPRIMIR!D511)","v":0},{"$f":"IF(E512=0,0,IMPRIMIR!E511)","v":0},0,0,0]
[null,{"$f":"IF(E513=0,0,IMPRIMIR!A512)","v":0},{"$f":"IF(E513=0,0,IMPRIMIR!$D$3)","v":0},0,{"$f":"IMPRIMIR!B512","v":0},{"$f":"IMPRIMIR!C512","v":0},{"$f":"IF(E513=0,0,IMPRIMIR!D512)","v":0},{"$f":"IF(E513=0,0,IMPRIMIR!E512)","v":0},0,0,0]
[null,{"$f":"IF(E514=0,0,IMPRIMIR!A513)","v":0},{"$f":"IF(E514=0,0,IMPRIMIR!$D$3)","v":0},0,{"$f":"IMPRIMIR!B513","v":0},{"$f":"IMPRIMIR!C513","v":0},{"$f":"IF(E514=0,0,IMPRIMIR!D513)","v":0},{"$f":"IF(E514=0,0,IMPRIMIR!E513)","v":0},0,0,0]
[null,{"$f":"IF(E515=0,0,IMPRIMIR!A514)","v":0},{"$f":"IF(E515=0,0,IMPRIMIR!$D$3)","v":0},0,{"$f":"IMPRIMIR!B514","v":0},{"$f":"IMPRIMIR!C514","v":0},{"$f":"IF(E515=0,0,IMPRIMIR!D514)","v":0},{"$f":"IF(E515=0,0,IMPRIMIR!E514)","v":0},0,0,0]
[null,{"$f":"IF(E516=0,0,IMPRIMIR!A515)","v":0},{"$f":"IF(E516=0,0,IMPRIMIR!$D$3)","v":0},0,{"$f":"IMPRIMIR!B515","v":0},{"$f":"IMPRIMIR!C515","v":0},{"$f":"IF(E516=0,0,IMPRIMIR!D515)","v":0},{"$f":"IF(E516=0,0,IMPRIMIR!E515)","v":0},0,0,0]
[null,{"$f":"IF(E517=0,0,IMPRIMIR!A516)","v":0},{"$f":"IF(E517=0,0,IMPRIMIR!$D$3)","v":0},0,{"$f":"IMPRIMIR!B516","v":0},{"$f":"IMPRIMIR!C516","v":0},{"$f":"IF(E517=0,0,IMPRIMIR!D516)","v":0},{"$f":"IF(E517=0,0,IMPRIMIR!E516)","v":0},0,0,0]
[null,{"$f":"IF(E518=0,0,IMPRIMIR!A517)","v":0},{"$f":"IF(E518=0,0,IMPRIMIR!$D$3)","v":0},0,{"$f":"IMPRIMIR!B517","v":0},{"$f":"IMPRIMIR!C517","v":0},{"$f":"IF(E518=0,0,IMPRIMIR!D517)","v":0},{"$f":"IF(E518=0,0,IMPRIMIR!E517)","v":0},0,0,0]
[null,{"$f":"IF(E519=0,0,IMPRIMIR!A518)","v":0},{"$f":"IF(E519=0,0,IMPRIMIR!$D$3)","v":0},0,{"$f":"IMPRIMIR!B518","v":0},{"$f":"IMPRIMIR!C518","v":0},{"$f":"IF(E519=0,0,IMPRIMIR!D518)","v":0},{"$f":"IF(E519=0,0,IMPRIMIR!E518)","v":0},0,0,0]
[null,{"$f":"IF(E520=0,0,IMPRIMIR!A519)","v":0},{"$f":"IF(E520=0,0,IMPRIMIR!$D$3)","v":0},0,{"$f":"IMPRIMIR!B519","v":0},{"$f":"IMPRIMIR!C519","v":0},{"$f":"IF(E520=0,0,IMPRIMIR!D519)","v":0},{"$f":"IF(E520=0,0,IMPRIMIR!E519)","v":0},0,0,0]
[null,{"$f":"IF(E521=0,0,IMPRIMIR!A520)","v":0},{"$f":"IF(E521=0,0,IMPRIMIR!$D$3)","v":0},0,{"$f":"IMPRIMIR!B520","v":0},{"$f":"IMPRIMIR!C520","v":0},{"$f":"IF(E521=0,0,IMPRIMIR!D520)","v":0},{"$f":"IF(E521=0,0,IMPRIMIR!E520)","v":0},0,0,0]
[null,{"$f":"IF(E522=0,0,IMPRIMIR!A521)","v":0},{"$f":"IF(E522=0,0,IMPRIMIR!$D$3)","v":0},0,{"$f":"IMPRIMIR!B521","v":0},{"$f":"IMPRIMIR!C521","v":0},{"$f":"IF(E522=0,0,IMPRIMIR!D521)","v":0},{"$f":"IF(E522=0,0,IMPRIMIR!E521)","v":0},0,0,0]
[null,{"$f":"IF(E523=0,0,IMPRIMIR!A522)","v":0},{"$f":"IF(E523=0,0,IMPRIMIR!$D$3)","v":0},0,{"$f":"IMPRIMIR!B522","v":0},{"$f":"IMPRIMIR!C522","v":0},{"$f":"IF(E523=0,0,IMPRIMIR!D522)","v":0},{"$f":"IF(E523=0,0,IMPRIMIR!E522)","v":0},0,0,0]
[null,{"$f":"IF(E524=0,0,IMPRIMIR!A523)","v":0},{"$f":"IF(E524=0,0,IMPRIMIR!$D$3)","v":0},0,{"$f":"IMPRIMIR!B523","v":0},{"$f":"IMPRIMIR!C523","v":0},{"$f":"IF(E524=0,0,IMPRIMIR!D523)","v":0},{"$f":"IF(E524=0,0,IMPRIMIR!E523)","v":0},0,0,0]
[null,{"$f":"IF(E525=0,0,IMPRIMIR!A524)","v":0},{"$f":"IF(E525=0,0,IMPRIMIR!$D$3)","v":0},0,{"$f":"IMPRIMIR!B524","v":0},{"$f":"IMPRIMIR!C524","v":0},{"$f":"IF(E525=0,0,IMPRIMIR!D524)","v":0},{"$f":"IF(E525=0,0,IMPRIMIR!E524)","v":0},0,0,0]
[null,{"$f":"IF(E526=0,0,IMPRIMIR!A525)","v":0},{"$f":"IF(E526=0,0,IMPRIMIR!$D$3)","v":0},0,{"$f":"IMPRIMIR!B525","v":0},{"$f":"IMPRIMIR!C525","v":0},{"$f":"IF(E526=0,0,IMPRIMIR!D525)","v":0},{"$f":"IF(E526=0,0,IMPRIMIR!E525)","v":0},0,0,0]
[null,{"$f":"IF(E527=0,0,IMPRIMIR!A526)","v":0},{"$f":"IF(E527=0,0,IMPRIMIR!$D$3)","v":0},0,{"$f":"IMPRIMIR!B526","v":0},{"$f":"IMPRIMIR!C526","v":0},{"$f":"IF(E527=0,0,IMPRIMIR!D526)","v":0},{"$f":"IF(E527=0,0,IMPRIMIR!E526)","v":0},0,0,0]
[null,{"$f":"IF(E528=0,0,IMPRIMIR!A527)","v":0},{"$f":"IF(E528=0,0,IMPRIMIR!$D$3)","v":0},0,{"$f":"IMPRIMIR!B527","v":0},{"$f":"IMPRIMIR!C527","v":0},{"$f":"IF(E528=0,0,IMPRIMIR!D527)","v":0},{"$f":"IF(E528=0,0,IMPRIMIR!E527)","v":0},0,0,0]
[null,{"$f":"IF(E529=0,0,IMPRIMIR!A528)","v":0},{"$f":"IF(E529=0,0,IMPRIMIR!$D$3)","v":0},0,{"$f":"IMPRIMIR!B528","v":0},{"$f":"IMPRIMIR!C528","v":0},{"$f":"IF(E529=0,0,IMPRIMIR!D528)","v":0},{"$f":"IF(E529=0,0,IMPRIMIR!E528)","v":0},0,0,0]
[null,{"$f":"IF(E530=0,0,IMPRIMIR!A529)","v":0},{"$f":"IF(E530=0,0,IMPRIMIR!$D$3)","v":0},0,{"$f":"IMPRIMIR!B529","v":0},{"$f":"IMPRIMIR!C529","v":0},{"$f":"IF(E530=0,0,IMPRIMIR!D529)","v":0},{"$f":"IF(E530=0,0,IMPRIMIR!E529)","v":0},0,0,0]
[null,{"$f":"IF(E531=0,0,IMPRIMIR!A530)","v":0},{"$f":"IF(E531=0,0,IMPRIMIR!$D$3)","v":0},0,{"$f":"IMPRIMIR!B530","v":0},{"$f":"IMPRIMIR!C530","v":0},{"$f":"IF(E531=0,0,IMPRIMIR!D530)","v":0},{"$f":"IF(E531=0,0,IMPRIMIR!E530)","v":0},0,0,0]
[null,{"$f":"IF(E532=0,0,IMPRIMIR!A531)","v":0},{"$f":"IF(E532=0,0,IMPRIMIR!$D$3)","v":0},0,{"$f":"IMPRIMIR!B531","v":0},{"$f":"IMPRIMIR!C531","v":0},{"$f":"IF(E532=0,0,IMPRIMIR!D531)","v":0},{"$f":"IF(E532=0,0,IMPRIMIR!E531)","v":0},0,0,0]
[null,{"$f":"IF(E533=0,0,IMPRIMIR!A532)","v":0},{"$f":"IF(E533=0,0,IMPRIMIR!$D$3)","v":0},0,{"$f":"IMPRIMIR!B532","v":0},{"$f":"IMPRIMIR!C532","v":0},{"$f":"IF(E533=0,0,IMPRIMIR!D532)","v":0},{"$f":"IF(E533=0,0,IMPRIMIR!E532)","v":0},0,0,0]
[null,{"$f":"IF(E534=0,0,IMPRIMIR!A533)","v":0},{"$f":"IF(E534=0,0,IMPRIMIR!$D$3)","v":0},0,{"$f":"IMPRIMIR!B533","v":0},{"$f":"IMPRIMIR!C533","v":0},{"$f":"IF(E534=0,0,IMPRIMIR!D533)","v":0},{"$f":"IF(E534=0,0,IMPRIMIR!E533)","v":0},0,0,0]
[null,{"$f":"IF(E535=0,0,IMPRIMIR!A534)","v":0},{"$f":"IF(E535=0,0,IMPRIMIR!$D$3)","v":0},0,{"$f":"IMPRIMIR!B534","v":0},{"$f":"IMPRIMIR!C534","v":0},{"$f":"IF(E535=0,0,IMPRIMIR!D534)","v":0},{"$f":"IF(E535=0,0,IMPRIMIR!E534)","v":0},0,0,0]
[null,{"$f":"IF(E536=0,0,IMPRIMIR!A535)","v":0},{"$f":"IF(E536=0,0,IMPRIMIR!$D$3)","v":0},0,{"$f":"IMPRIMIR!B535","v":0},{"$f":"IMPRIMIR!C535","v":0},{"$f":"IF(E536=0,0,IMPRIMIR!D535)","v":0},{"$f":"IF(E536=0,0,IMPRIMIR!E535)","v":0},0,0,0]
[null,{"$f":"IF(E537=0,0,IMPRIMIR!A536)","v":0},{"$f":"IF(E537=0,0,IMPRIMIR!$D$3)","v":0},0,{"$f":"IMPRIMIR!B536","v":0},{"$f":"IMPRIMIR!C536","v":0},{"$f":"IF(E537=0,0,IMPRIMIR!D536)","v":0},{"$f":"IF(E537=0,0,IMPRIMIR!E536)","v":0},0,0,0]
[null,{"$f":"IF(E538=0,0,IMPRIMIR!A537)","v":0},{"$f":"IF(E538=0,0,IMPRIMIR!$D$3)","v":0},0,{"$f":"IMPRIMIR!B537","v":0},{"$f":"IMPRIMIR!C537","v":0},{"$f":"IF(E538=0,0,IMPRIMIR!D537)","v":0},{"$f":"IF(E538=0,0,IMPRIMIR!E537)","v":0},0,0,0]
[null,{"$f":"IF(E539=0,0,IMPRIMIR!A538)","v":0},{"$f":"IF(E539=0,0,IMPRIMIR!$D$3)","v":0},0,{"$f":"IMPRIMIR!B538","v":0},{"$f":"IMPRIMIR!C538","v":0},{"$f":"IF(E539=0,0,IMPRIMIR!D538)","v":0},{"$f":"IF(E539=0,0,IMPRIMIR!E538)","v":0},0,0,0]
[null,{"$f":"IF(E540=0,0,IMPRIMIR!A539)","v":0},{"$f":"IF(E540=0,0,IMPRIMIR!$D$3)","v":0},0,{"$f":"IMPRIMIR!B539","v":0},{"$f":"IMPRIMIR!C539","v":0},{"$f":"IF(E540=0,0,IMPRIMIR!D539)","v":0},{"$f":"IF(E540=0,0,IMPRIMIR!E539)","v":0},0,0,0]
[null,{"$f":"IF(E541=0,0,IMPRIMIR!A540)","v":0},{"$f":"IF(E541=0,0,IMPRIMIR!$D$3)","v":0},0,{"$f":"IMPRIMIR!B540","v":0},{"$f":"IMPRIMIR!C540","v":0},{"$f":"IF(E541=0,0,IMPRIMIR!D540)","v":0},{"$f":"IF(E541=0,0,IMPRIMIR!E540)","v":0},0,0,0]
[null,{"$f":"IF(E542=0,0,IMPRIMIR!A541)","v":0},{"$f":"IF(E542=0,0,IMPRIMIR!$D$3)","v":0},0,{"$f":"IMPRIMIR!B541","v":0},{"$f":"IMPRIMIR!C541","v":0},{"$f":"IF(E542=0,0,IMPRIMIR!D541)","v":0},{"$f":"IF(E542=0,0,IMPRIMIR!E541)","v":0},0,0,0]
[null,{"$f":"IF(E543=0,0,IMPRIMIR!A542)","v":0},{"$f":"IF(E543=0,0,IMPRIMIR!$D$3)","v":0},0,{"$f":"IMPRIMIR!B542","v":0},{"$f":"IMPRIMIR!C542","v":0},{"$f":"IF(E543=0,0,IMPRIMIR!D542)","v":0},{"$f":"IF(E543=0,0,IMPRIMIR!E542)","v":0},0,0,0]
[null,{"$f":"IF(E544=0,0,IMPRIMIR!A543)","v":0},{"$f":"IF(E544=0,0,IMPRIMIR!$D$3)","v":0},0,{"$f":"IMPRIMIR!B543","v":0},{"$f":"IMPRIMIR!C543","v":0},{"$f":"IF(E544=0,0,IMPRIMIR!D543)","v":0},{"$f":"IF(E544=0,0,IMPRIMIR!E543)","v":0},0,0,0]
[null,{"$f":"IF(E545=0,0,IMPRIMIR!A544)","v":0},{"$f":"IF(E545=0,0,IMPRIMIR!$D$3)","v":0},0,{"$f":"IMPRIMIR!B544","v":0},{"$f":"IMPRIMIR!C544","v":0},{"$f":"IF(E545=0,0,IMPRIMIR!D544)","v":0},{"$f":"IF(E545=0,0,IMPRIMIR!E544)","v":0},0,0,0]
[null,{"$f":"IF(E546=0,0,IMPRIMIR!A545)","v":0},{"$f":"IF(E546=0,0,IMPRIMIR!$D$3)","v":0},0,{"$f":"IMPRIMIR!B545","v":0},{"$f":"IMPRIMIR!C545","v":0},{"$f":"IF(E546=0,0,IMPRIMIR!D545)","v":0},{"$f":"IF(E546=0,0,IMPRIMIR!E545)","v":0},0,0,0]
[null,{"$f":"IF(E547=0,0,IMPRIMIR!A546)","v":0},{"$f":"IF(E547=0,0,IMPRIMIR!$D$3)","v":0},0,{"$f":"IMPRIMIR!B546","v":0},{"$f":"IMPRIMIR!C546","v":0},{"$f":"IF(E547=0,0,IMPRIMIR!D546)","v":0},{"$f":"IF(E547=0,0,IMPRIMIR!E546)","v":0},0,0,0]
[null,{"$f":"IF(E548=0,0,IMPRIMIR!A547)","v":0},{"$f":"IF(E548=0,0,IMPRIMIR!$D$3)","v":0},0,{"$f":"IMPRIMIR!B547","v":0},{"$f":"IMPRIMIR!C547","v":0},{"$f":"IF(E548=0,0,IMPRIMIR!D547)","v":0},{"$f":"IF(E548=0,0,IMPRIMIR!E547)","v":0},0,0,0]
[null,{"$f":"IF(E549=0,0,IMPRIMIR!A548)","v":0},{"$f":"IF(E549=0,0,IMPRIMIR!$D$3)","v":0},0,{"$f":"IMPRIMIR!B548","v":0},{"$f":"IMPRIMIR!C548","v":0},{"$f":"IF(E549=0,0,IMPRIMIR!D548)","v":0},{"$f":"IF(E549=0,0,IMPRIMIR!E548)","v":0},0,0,0]
[null,{"$f":"IF(E550=0,0,IMPRIMIR!A549)","v":0},{"$f":"IF(E550=0,0,IMPRIMIR!$D$3)","v":0},{"$f":"IF(E550=\"0\",0,$G$2)","v":0},{"$f":"IMPRIMIR!B549","v":0},{"$f":"IMPRIMIR!C549","v":0},{"$f":"IF(E550=0,0,IMPRIMIR!D549)","v":0},{"$f":"IF(E550=0,0,IMPRIMIR!E549)","v":0},{"$f":"IF(E550=0,0,$G$2)","v":0},{"$f":"IF(E550=0,0,$G$4)","v":0},{"$f":"IF(E550=0,0,$G$3)","v":0}]
[null,{"$f":"IF(E551=0,0,IMPRIMIR!A550)","v":0},{"$f":"IF(E551=0,0,IMPRIMIR!$D$3)","v":0},0,{"$f":"IMPRIMIR!B550","v":0},{"$f":"IMPRIMIR!C550","v":0},{"$f":"IF(E551=0,0,IMPRIMIR!D550)","v":0},{"$f":"IF(E551=0,0,IMPRIMIR!E550)","v":0},0,0,0]
[null,{"$f":"IF(E552=0,0,IMPRIMIR!A551)","v":0},{"$f":"IF(E552=0,0,IMPRIMIR!$D$3)","v":0},0,{"$f":"IMPRIMIR!B551","v":0},{"$f":"IMPRIMIR!C551","v":0},{"$f":"IF(E552=0,0,IMPRIMIR!D551)","v":0},{"$f":"IF(E552=0,0,IMPRIMIR!E551)","v":0},0,0,0]
[null,{"$f":"IF(E553=0,0,IMPRIMIR!A552)","v":0},{"$f":"IF(E553=0,0,IMPRIMIR!$D$3)","v":0},0,{"$f":"IMPRIMIR!B552","v":0},{"$f":"IMPRIMIR!C552","v":0},{"$f":"IF(E553=0,0,IMPRIMIR!D552)","v":0},{"$f":"IF(E553=0,0,IMPRIMIR!E552)","v":0},0,0,0]
[null,{"$f":"IF(E554=0,0,IMPRIMIR!A553)","v":0},{"$f":"IF(E554=0,0,IMPRIMIR!$D$3)","v":0},0,{"$f":"IMPRIMIR!B553","v":0},{"$f":"IMPRIMIR!C553","v":0},{"$f":"IF(E554=0,0,IMPRIMIR!D553)","v":0},{"$f":"IF(E554=0,0,IMPRIMIR!E553)","v":0},0,0,0]
[null,{"$f":"IF(E555=0,0,IMPRIMIR!A554)","v":0},{"$f":"IF(E555=0,0,IMPRIMIR!$D$3)","v":0},0,{"$f":"IMPRIMIR!B554","v":0},{"$f":"IMPRIMIR!C554","v":0},{"$f":"IF(E555=0,0,IMPRIMIR!D554)","v":0},{"$f":"IF(E555=0,0,IMPRIMIR!E554)","v":0},0,0,0]
[null,{"$f":"IF(E556=0,0,IMPRIMIR!A555)","v":0},{"$f":"IF(E556=0,0,IMPRIMIR!$D$3)","v":0},0,{"$f":"IMPRIMIR!B555","v":0},{"$f":"IMPRIMIR!C555","v":0},{"$f":"IF(E556=0,0,IMPRIMIR!D555)","v":0},{"$f":"IF(E556=0,0,IMPRIMIR!E555)","v":0},0,0,0]
[null,{"$f":"IF(E557=0,0,IMPRIMIR!A556)","v":0},{"$f":"IF(E557=0,0,IMPRIMIR!$D$3)","v":0},0,{"$f":"IMPRIMIR!B556","v":0},{"$f":"IMPRIMIR!C556","v":0},{"$f":"IF(E557=0,0,IMPRIMIR!D556)","v":0},{"$f":"IF(E557=0,0,IMPRIMIR!E556)","v":0},0,0,0]
[null,{"$f":"IF(E558=0,0,IMPRIMIR!A557)","v":0},{"$f":"IF(E558=0,0,IMPRIMIR!$D$3)","v":0},0,{"$f":"IMPRIMIR!B557","v":0},{"$f":"IMPRIMIR!C557","v":0},{"$f":"IF(E558=0,0,IMPRIMIR!D557)","v":0},{"$f":"IF(E558=0,0,IMPRIMIR!E557)","v":0},0,0,0]
[null,{"$f":"IF(E559=0,0,IMPRIMIR!A558)","v":0},{"$f":"IF(E559=0,0,IMPRIMIR!$D$3)","v":0},0,{"$f":"IMPRIMIR!B558","v":0},{"$f":"IMPRIMIR!C558","v":0},{"$f":"IF(E559=0,0,IMPRIMIR!D558)","v":0},{"$f":"IF(E559=0,0,IMPRIMIR!E558)","v":0},0,0,0]
[null,{"$f":"IF(E560=0,0,IMPRIMIR!A559)","v":0},{"$f":"IF(E560=0,0,IMPRIMIR!$D$3)","v":0},0,{"$f":"IMPRIMIR!B559","v":0},{"$f":"IMPRIMIR!C559","v":0},{"$f":"IF(E560=0,0,IMPRIMIR!D559)","v":0},{"$f":"IF(E560=0,0,IMPRIMIR!E559)","v":0},0,0,0]
[null,{"$f":"IF(E561=0,0,IMPRIMIR!A560)","v":0},{"$f":"IF(E561=0,0,IMPRIMIR!$D$3)","v":0},0,{"$f":"IMPRIMIR!B560","v":0},{"$f":"IMPRIMIR!C560","v":0},{"$f":"IF(E561=0,0,IMPRIMIR!D560)","v":0},{"$f":"IF(E561=0,0,IMPRIMIR!E560)","v":0},0,0,0]
[null,{"$f":"IF(E562=0,0,IMPRIMIR!A561)","v":0},{"$f":"IF(E562=0,0,IMPRIMIR!$D$3)","v":0},0,{"$f":"IMPRIMIR!B561","v":0},{"$f":"IMPRIMIR!C561","v":0},{"$f":"IF(E562=0,0,IMPRIMIR!D561)","v":0},{"$f":"IF(E562=0,0,IMPRIMIR!E561)","v":0},0,0,0]
[null,{"$f":"IF(E563=0,0,IMPRIMIR!A562)","v":0},{"$f":"IF(E563=0,0,IMPRIMIR!$D$3)","v":0},0,{"$f":"IMPRIMIR!B562","v":0},{"$f":"IMPRIMIR!C562","v":0},{"$f":"IF(E563=0,0,IMPRIMIR!D562)","v":0},{"$f":"IF(E563=0,0,IMPRIMIR!E562)","v":0},0,0,0]
[null,{"$f":"IF(E564=0,0,IMPRIMIR!A563)","v":0},{"$f":"IF(E564=0,0,IMPRIMIR!$D$3)","v":0},0,{"$f":"IMPRIMIR!B563","v":0},{"$f":"IMPRIMIR!C563","v":0},{"$f":"IF(E564=0,0,IMPRIMIR!D563)","v":0},{"$f":"IF(E564=0,0,IMPRIMIR!E563)","v":0},0,0,0]
[null,{"$f":"IF(E565=0,0,IMPRIMIR!A564)","v":0},{"$f":"IF(E565=0,0,IMPRIMIR!$D$3)","v":0},0,{"$f":"IMPRIMIR!B564","v":0},{"$f":"IMPRIMIR!C564","v":0},{"$f":"IF(E565=0,0,IMPRIMIR!D564)","v":0},{"$f":"IF(E565=0,0,IMPRIMIR!E564)","v":0},0,0,0]
[null,{"$f":"IF(E566=0,0,IMPRIMIR!A565)","v":0},{"$f":"IF(E566=0,0,IMPRIMIR!$D$3)","v":0},0,{"$f":"IMPRIMIR!B565","v":0},{"$f":"IMPRIMIR!C565","v":0},{"$f":"IF(E566=0,0,IMPRIMIR!D565)","v":0},{"$f":"IF(E566=0,0,IMPRIMIR!E565)","v":0},0,0,0]
[null,{"$f":"IF(E567=0,0,IMPRIMIR!A566)","v":0},{"$f":"IF(E567=0,0,IMPRIMIR!$D$3)","v":0},0,{"$f":"IMPRIMIR!B566","v":0},{"$f":"IMPRIMIR!C566","v":0},{"$f":"IF(E567=0,0,IMPRIMIR!D566)","v":0},{"$f":"IF(E567=0,0,IMPRIMIR!E566)","v":0},0,0,0]
[null,{"$f":"IF(E568=0,0,IMPRIMIR!A567)","v":0},{"$f":"IF(E568=0,0,IMPRIMIR!$D$3)","v":0},0,{"$f":"IMPRIMIR!B567","v":0},{"$f":"IMPRIMIR!C567","v":0},{"$f":"IF(E568=0,0,IMPRIMIR!D567)","v":0},{"$f":"IF(E568=0,0,IMPRIMIR!E567)","v":0},0,0,0]
[null,{"$f":"IF(E569=0,0,IMPRIMIR!A568)","v":0},{"$f":"IF(E569=0,0,IMPRIMIR!$D$3)","v":0},0,{"$f":"IMPRIMIR!B568","v":0},{"$f":"IMPRIMIR!C568","v":0},{"$f":"IF(E569=0,0,IMPRIMIR!D568)","v":0},{"$f":"IF(E569=0,0,IMPRIMIR!E568)","v":0},0,0,0]
[null,{"$f":"IF(E570=0,0,IMPRIMIR!A569)","v":0},{"$f":"IF(E570=0,0,IMPRIMIR!$D$3)","v":0},0,{"$f":"IMPRIMIR!B569","v":0},{"$f":"IMPRIMIR!C569","v":0},{"$f":"IF(E570=0,0,IMPRIMIR!D569)","v":0},{"$f":"IF(E570=0,0,IMPRIMIR!E569)","v":0},0,0,0]
[null,{"$f":"IF(E571=0,0,IMPRIMIR!A570)","v":0},{"$f":"IF(E571=0,0,IMPRIMIR!$D$3)","v":0},0,{"$f":"IMPRIMIR!B570","v":0},{"$f":"IMPRIMIR!C570","v":0},{"$f":"IF(E571=0,0,IMPRIMIR!D570)","v":0},{"$f":"IF(E571=0,0,IMPRIMIR!E570)","v":0},0,0,0]
[null,{"$f":"IF(E572=0,0,IMPRIMIR!A571)","v":0},{"$f":"IF(E572=0,0,IMPRIMIR!$D$3)","v":0},0,{"$f":"IMPRIMIR!B571","v":0},{"$f":"IMPRIMIR!C571","v":0},{"$f":"IF(E572=0,0,IMPRIMIR!D571)","v":0},{"$f":"IF(E572=0,0,IMPRIMIR!E571)","v":0},0,0,0]
[null,{"$f":"IF(E573=0,0,IMPRIMIR!A572)","v":0},{"$f":"IF(E573=0,0,IMPRIMIR!$D$3)","v":0},0,{"$f":"IMPRIMIR!B572","v":0},{"$f":"IMPRIMIR!C572","v":0},{"$f":"IF(E573=0,0,IMPRIMIR!D572)","v":0},{"$f":"IF(E573=0,0,IMPRIMIR!E572)","v":0},0,0,0]
[null,{"$f":"IF(E574=0,0,IMPRIMIR!A573)","v":0},{"$f":"IF(E574=0,0,IMPRIMIR!$D$3)","v":0},0,{"$f":"IMPRIMIR!B573","v":0},{"$f":"IMPRIMIR!C573","v":0},{"$f":"IF(E574=0,0,IMPRIMIR!D573)","v":0},{"$f":"IF(E574=0,0,IMPRIMIR!E573)","v":0},0,0,0]
[null,{"$f":"IF(E575=0,0,IMPRIMIR!A574)","v":0},{"$f":"IF(E575=0,0,IMPRIMIR!$D$3)","v":0},0,{"$f":"IMPRIMIR!B574","v":0},{"$f":"IMPRIMIR!C574","v":0},{"$f":"IF(E575=0,0,IMPRIMIR!D574)","v":0},{"$f":"IF(E575=0,0,IMPRIMIR!E574)","v":0},0,0,0]
[null,{"$f":"IF(E576=0,0,IMPRIMIR!A575)","v":0},{"$f":"IF(E576=0,0,IMPRIMIR!$D$3)","v":0},0,{"$f":"IMPRIMIR!B575","v":0},{"$f":"IMPRIMIR!C575","v":0},{"$f":"IF(E576=0,0,IMPRIMIR!D575)","v":0},{"$f":"IF(E576=0,0,IMPRIMIR!E575)","v":0},0,0,0]
[null,{"$f":"IF(E577=0,0,IMPRIMIR!A576)","v":0},{"$f":"IF(E577=0,0,IMPRIMIR!$D$3)","v":0},0,{"$f":"IMPRIMIR!B576","v":0},{"$f":"IMPRIMIR!C576","v":0},{"$f":"IF(E577=0,0,IMPRIMIR!D576)","v":0},{"$f":"IF(E577=0,0,IMPRIMIR!E576)","v":0},0,0,0]
[null,{"$f":"IF(E578=0,0,IMPRIMIR!A577)","v":0},{"$f":"IF(E578=0,0,IMPRIMIR!$D$3)","v":0},0,{"$f":"IMPRIMIR!B577","v":0},{"$f":"IMPRIMIR!C577","v":0},{"$f":"IF(E578=0,0,IMPRIMIR!D577)","v":0},{"$f":"IF(E578=0,0,IMPRIMIR!E577)","v":0},0,0,0]
[null,{"$f":"IF(E579=0,0,IMPRIMIR!A578)","v":0},{"$f":"IF(E579=0,0,IMPRIMIR!$D$3)","v":0},0,{"$f":"IMPRIMIR!B578","v":0},{"$f":"IMPRIMIR!C578","v":0},{"$f":"IF(E579=0,0,IMPRIMIR!D578)","v":0},{"$f":"IF(E579=0,0,IMPRIMIR!E578)","v":0},0,0,0]
[null,{"$f":"IF(E580=0,0,IMPRIMIR!A579)","v":0},{"$f":"IF(E580=0,0,IMPRIMIR!$D$3)","v":0},0,{"$f":"IMPRIMIR!B579","v":0},{"$f":"IMPRIMIR!C579","v":0},{"$f":"IF(E580=0,0,IMPRIMIR!D579)","v":0},{"$f":"IF(E580=0,0,IMPRIMIR!E579)","v":0},0,0,0]
[null,{"$f":"IF(E581=0,0,IMPRIMIR!A580)","v":0},{"$f":"IF(E581=0,0,IMPRIMIR!$D$3)","v":0},0,{"$f":"IMPRIMIR!B580","v":0},{"$f":"IMPRIMIR!C580","v":0},{"$f":"IF(E581=0,0,IMPRIMIR!D580)","v":0},{"$f":"IF(E581=0,0,IMPRIMIR!E580)","v":0},0,0,0]
[null,{"$f":"IF(E582=0,0,IMPRIMIR!A581)","v":0},{"$f":"IF(E582=0,0,IMPRIMIR!$D$3)","v":0},0,{"$f":"IMPRIMIR!B581","v":0},{"$f":"IMPRIMIR!C581","v":0},{"$f":"IF(E582=0,0,IMPRIMIR!D581)","v":0},{"$f":"IF(E582=0,0,IMPRIMIR!E581)","v":0},0,0,0]
[null,{"$f":"IF(E583=0,0,IMPRIMIR!A582)","v":0},{"$f":"IF(E583=0,0,IMPRIMIR!$D$3)","v":0},0,{"$f":"IMPRIMIR!B582","v":0},{"$f":"IMPRIMIR!C582","v":0},{"$f":"IF(E583=0,0,IMPRIMIR!D582)","v":0},{"$f":"IF(E583=0,0,IMPRIMIR!E582)","v":0},0,0,0]
[null,{"$f":"IF(E584=0,0,IMPRIMIR!A583)","v":0},{"$f":"IF(E584=0,0,IMPRIMIR!$D$3)","v":0},0,{"$f":"IMPRIMIR!B583","v":0},{"$f":"IMPRIMIR!C583","v":0},{"$f":"IF(E584=0,0,IMPRIMIR!D583)","v":0},{"$f":"IF(E584=0,0,IMPRIMIR!E583)","v":0},0,0,0]
[null,{"$f":"IF(E585=0,0,IMPRIMIR!A584)","v":0},{"$f":"IF(E585=0,0,IMPRIMIR!$D$3)","v":0},0,{"$f":"IMPRIMIR!B584","v":0},{"$f":"IMPRIMIR!C584","v":0},{"$f":"IF(E585=0,0,IMPRIMIR!D584)","v":0},{"$f":"IF(E585=0,0,IMPRIMIR!E584)","v":0},0,0,0]
[null,{"$f":"IF(E586=0,0,IMPRIMIR!A585)","v":0},{"$f":"IF(E586=0,0,IMPRIMIR!$D$3)","v":0},0,{"$f":"IMPRIMIR!B585","v":0},{"$f":"IMPRIMIR!C585","v":0},{"$f":"IF(E586=0,0,IMPRIMIR!D585)","v":0},{"$f":"IF(E586=0,0,IMPRIMIR!E585)","v":0},0,0,0]
[null,{"$f":"IF(E587=0,0,IMPRIMIR!A586)","v":0},{"$f":"IF(E587=0,0,IMPRIMIR!$D$3)","v":0},0,{"$f":"IMPRIMIR!B586","v":0},{"$f":"IMPRIMIR!C586","v":0},{"$f":"IF(E587=0,0,IMPRIMIR!D586)","v":0},{"$f":"IF(E587=0,0,IMPRIMIR!E586)","v":0},0,0,0]
[null,{"$f":"IF(E588=0,0,IMPRIMIR!A587)","v":0},{"$f":"IF(E588=0,0,IMPRIMIR!$D$3)","v":0},0,{"$f":"IMPRIMIR!B587","v":0},{"$f":"IMPRIMIR!C587","v":0},{"$f":"IF(E588=0,0,IMPRIMIR!D587)","v":0},{"$f":"IF(E588=0,0,IMPRIMIR!E587)","v":0},0,0,0]
[null,{"$f":"IF(E589=0,0,IMPRIMIR!A588)","v":0},{"$f":"IF(E589=0,0,IMPRIMIR!$D$3)","v":0},0,{"$f":"IMPRIMIR!B588","v":0},{"$f":"IMPRIMIR!C588","v":0},{"$f":"IF(E589=0,0,IMPRIMIR!D588)","v":0},{"$f":"IF(E589=0,0,IMPRIMIR!E588)","v":0},0,0,0]
[null,{"$f":"IF(E590=0,0,IMPRIMIR!A589)","v":0},{"$f":"IF(E590=0,0,IMPRIMIR!$D$3)","v":0},0,{"$f":"IMPRIMIR!B589","v":0},{"$f":"IMPRIMIR!C589","v":0},{"$f":"IF(E590=0,0,IMPRIMIR!D589)","v":0},{"$f":"IF(E590=0,0,IMPRIMIR!E589)","v":0},0,0,0]
[null,{"$f":"IF(E591=0,0,IMPRIMIR!A590)","v":0},{"$f":"IF(E591=0,0,IMPRIMIR!$D$3)","v":0},0,{"$f":"IMPRIMIR!B590","v":0},{"$f":"IMPRIMIR!C590","v":0},{"$f":"IF(E591=0,0,IMPRIMIR!D590)","v":0},{"$f":"IF(E591=0,0,IMPRIMIR!E590)","v":0},0,0,0]
[null,{"$f":"IF(E592=0,0,IMPRIMIR!A591)","v":0},{"$f":"IF(E592=0,0,IMPRIMIR!$D$3)","v":0},0,{"$f":"IMPRIMIR!B591","v":0},{"$f":"IMPRIMIR!C591","v":0},{"$f":"IF(E592=0,0,IMPRIMIR!D591)","v":0},{"$f":"IF(E592=0,0,IMPRIMIR!E591)","v":0},0,0,0]
[null,{"$f":"IF(E593=0,0,IMPRIMIR!A592)","v":0},{"$f":"IF(E593=0,0,IMPRIMIR!$D$3)","v":0},0,{"$f":"IMPRIMIR!B592","v":0},{"$f":"IMPRIMIR!C592","v":0},{"$f":"IF(E593=0,0,IMPRIMIR!D592)","v":0},{"$f":"IF(E593=0,0,IMPRIMIR!E592)","v":0},0,0,0]
[null,{"$f":"IF(E594=0,0,IMPRIMIR!A593)","v":0},{"$f":"IF(E594=0,0,IMPRIMIR!$D$3)","v":0},0,{"$f":"IMPRIMIR!B593","v":0},{"$f":"IMPRIMIR!C593","v":0},{"$f":"IF(E594=0,0,IMPRIMIR!D593)","v":0},{"$f":"IF(E594=0,0,IMPRIMIR!E593)","v":0},0,0,0]
[null,{"$f":"IF(E595=0,0,IMPRIMIR!A594)","v":0},{"$f":"IF(E595=0,0,IMPRIMIR!$D$3)","v":0},0,{"$f":"IMPRIMIR!B594","v":0},{"$f":"IMPRIMIR!C594","v":0},{"$f":"IF(E595=0,0,IMPRIMIR!D594)","v":0},{"$f":"IF(E595=0,0,IMPRIMIR!E594)","v":0},0,0,0]
[null,{"$f":"IF(E596=0,0,IMPRIMIR!A595)","v":0},{"$f":"IF(E596=0,0,IMPRIMIR!$D$3)","v":0},0,{"$f":"IMPRIMIR!B595","v":0},{"$f":"IMPRIMIR!C595","v":0},{"$f":"IF(E596=0,0,IMPRIMIR!D595)","v":0},{"$f":"IF(E596=0,0,IMPRIMIR!E595)","v":0},0,0,0]
[null,{"$f":"IF(E597=0,0,IMPRIMIR!A596)","v":0},{"$f":"IF(E597=0,0,IMPRIMIR!$D$3)","v":0},0,{"$f":"IMPRIMIR!B596","v":0},{"$f":"IMPRIMIR!C596","v":0},{"$f":"IF(E597=0,0,IMPRIMIR!D596)","v":0},{"$f":"IF(E597=0,0,IMPRIMIR!E596)","v":0},0,0,0]
[null,{"$f":"IF(E598=0,0,IMPRIMIR!A597)","v":0},{"$f":"IF(E598=0,0,IMPRIMIR!$D$3)","v":0},0,{"$f":"IMPRIMIR!B597","v":0},{"$f":"IMPRIMIR!C597","v":0},{"$f":"IF(E598=0,0,IMPRIMIR!D597)","v":0},{"$f":"IF(E598=0,0,IMPRIMIR!E597)","v":0},0,0,0]
[null,{"$f":"IF(E599=0,0,IMPRIMIR!A598)","v":0},{"$f":"IF(E599=0,0,IMPRIMIR!$D$3)","v":0},0,{"$f":"IMPRIMIR!B598","v":0},{"$f":"IMPRIMIR!C598","v":0},{"$f":"IF(E599=0,0,IMPRIMIR!D598)","v":0},{"$f":"IF(E599=0,0,IMPRIMIR!E598)","v":0},0,0,0]
[null,{"$f":"IF(E600=0,0,IMPRIMIR!A599)","v":0},{"$f":"IF(E600=0,0,IMPRIMIR!$D$3)","v":0},0,{"$f":"IMPRIMIR!B599","v":0},{"$f":"IMPRIMIR!C599","v":0},{"$f":"IF(E600=0,0,IMPRIMIR!D599)","v":0},{"$f":"IF(E600=0,0,IMPRIMIR!E599)","v":0},0,0,0]
[null,{"$f":"IF(E601=0,0,IMPRIMIR!A600)","v":0},{"$f":"IF(E601=0,0,IMPRIMIR!$D$3)","v":0},0,{"$f":"IMPRIMIR!B600","v":0},{"$f":"IMPRIMIR!C600","v":0},{"$f":"IF(E601=0,0,IMPRIMIR!D600)","v":0},{"$f":"IF(E601=0,0,IMPRIMIR!E600)","v":0},0,0,0]
[null,{"$f":"IF(E602=0,0,IMPRIMIR!A601)","v":0},{"$f":"IF(E602=0,0,IMPRIMIR!$D$3)","v":0},0,{"$f":"IMPRIMIR!B601","v":0},{"$f":"IMPRIMIR!C601","v":0},{"$f":"IF(E602=0,0,IMPRIMIR!D601)","v":0},{"$f":"IF(E602=0,0,IMPRIMIR!E601)","v":0},0,0,0]
[null,{"$f":"IF(E603=0,0,IMPRIMIR!A602)","v":0},{"$f":"IF(E603=0,0,IMPRIMIR!$D$3)","v":0},0,{"$f":"IMPRIMIR!B602","v":0},{"$f":"IMPRIMIR!C602","v":0},{"$f":"IF(E603=0,0,IMPRIMIR!D602)","v":0},{"$f":"IF(E603=0,0,IMPRIMIR!E602)","v":0},0,0,0]
[null,{"$f":"IF(E604=0,0,IMPRIMIR!A603)","v":0},{"$f":"IF(E604=0,0,IMPRIMIR!$D$3)","v":0},0,{"$f":"IMPRIMIR!B603","v":0},{"$f":"IMPRIMIR!C603","v":0},{"$f":"IF(E604=0,0,IMPRIMIR!D603)","v":0},{"$f":"IF(E604=0,0,IMPRIMIR!E603)","v":0},0,0,0]
[null,{"$f":"IF(E605=0,0,IMPRIMIR!A604)","v":0},{"$f":"IF(E605=0,0,IMPRIMIR!$D$3)","v":0},0,{"$f":"IMPRIMIR!B604","v":0},{"$f":"IMPRIMIR!C604","v":0},{"$f":"IF(E605=0,0,IMPRIMIR!D604)","v":0},{"$f":"IF(E605=0,0,IMPRIMIR!E604)","v":0},0,0,0]
[null,{"$f":"IF(E606=0,0,IMPRIMIR!A605)","v":0},{"$f":"IF(E606=0,0,IMPRIMIR!$D$3)","v":0},0,{"$f":"IMPRIMIR!B605","v":0},{"$f":"IMPRIMIR!C605","v":0},{"$f":"IF(E606=0,0,IMPRIMIR!D605)","v":0},{"$f":"IF(E606=0,0,IMPRIMIR!E605)","v":0},0,0,0]
[null,{"$f":"IF(E607=0,0,IMPRIMIR!A606)","v":0},{"$f":"IF(E607=0,0,IMPRIMIR!$D$3)","v":0},0,{"$f":"IMPRIMIR!B606","v":0},{"$f":"IMPRIMIR!C606","v":0},{"$f":"IF(E607=0,0,IMPRIMIR!D606)","v":0},{"$f":"IF(E607=0,0,IMPRIMIR!E606)","v":0},0,0,0]
[null,{"$f":"IF(E608=0,0,IMPRIMIR!A607)","v":0},{"$f":"IF(E608=0,0,IMPRIMIR!$D$3)","v":0},0,{"$f":"IMPRIMIR!B607","v":0},{"$f":"IMPRIMIR!C607","v":0},{"$f":"IF(E608=0,0,IMPRIMIR!D607)","v":0},{"$f":"IF(E608=0,0,IMPRIMIR!E607)","v":0},0,0,0]
[null,{"$f":"IF(E609=0,0,IMPRIMIR!A608)","v":0},{"$f":"IF(E609=0,0,IMPRIMIR!$D$3)","v":0},0,{"$f":"IMPRIMIR!B608","v":0},{"$f":"IMPRIMIR!C608","v":0},{"$f":"IF(E609=0,0,IMPRIMIR!D608)","v":0},{"$f":"IF(E609=0,0,IMPRIMIR!E608)","v":0},0,0,0]
[null,{"$f":"IF(E610=0,0,IMPRIMIR!A609)","v":0},{"$f":"IF(E610=0,0,IMPRIMIR!$D$3)","v":0},0,{"$f":"IMPRIMIR!B609","v":0},{"$f":"IMPRIMIR!C609","v":0},{"$f":"IF(E610=0,0,IMPRIMIR!D609)","v":0},{"$f":"IF(E610=0,0,IMPRIMIR!E609)","v":0},0,0,0]
[null,{"$f":"IF(E611=0,0,IMPRIMIR!A610)","v":0},{"$f":"IF(E611=0,0,IMPRIMIR!$D$3)","v":0},0,{"$f":"IMPRIMIR!B610","v":0},{"$f":"IMPRIMIR!C610","v":0},{"$f":"IF(E611=0,0,IMPRIMIR!D610)","v":0},{"$f":"IF(E611=0,0,IMPRIMIR!E610)","v":0},0,0,0]
[null,{"$f":"IF(E612=0,0,IMPRIMIR!A611)","v":0},{"$f":"IF(E612=0,0,IMPRIMIR!$D$3)","v":0},0,{"$f":"IMPRIMIR!B611","v":0},{"$f":"IMPRIMIR!C611","v":0},{"$f":"IF(E612=0,0,IMPRIMIR!D611)","v":0},{"$f":"IF(E612=0,0,IMPRIMIR!E611)","v":0},0,0,0]
[null,{"$f":"IF(E613=0,0,IMPRIMIR!A612)","v":0},{"$f":"IF(E613=0,0,IMPRIMIR!$D$3)","v":0},0,{"$f":"IMPRIMIR!B612","v":0},{"$f":"IMPRIMIR!C612","v":0},{"$f":"IF(E613=0,0,IMPRIMIR!D612)","v":0},{"$f":"IF(E613=0,0,IMPRIMIR!E612)","v":0},0,0,0]
[null,{"$f":"IF(E614=0,0,IMPRIMIR!A613)","v":0},{"$f":"IF(E614=0,0,IMPRIMIR!$D$3)","v":0},{"$f":"IF(E614=\"0\",0,$G$2)","v":0},{"$f":"IMPRIMIR!B613","v":0},{"$f":"IMPRIMIR!C613","v":0},{"$f":"IF(E614=0,0,IMPRIMIR!D613)","v":0},{"$f":"IF(E614=0,0,IMPRIMIR!E613)","v":0},{"$f":"IF(E614=0,0,$G$2)","v":0},{"$f":"IF(E614=0,0,$G$4)","v":0},{"$f":"IF(E614=0,0,$G$3)","v":0}]
[null,{"$f":"IF(E615=0,0,IMPRIMIR!A614)","v":0},{"$f":"IF(E615=0,0,IMPRIMIR!$D$3)","v":0},0,{"$f":"IMPRIMIR!B614","v":0},{"$f":"IMPRIMIR!C614","v":0},{"$f":"IF(E615=0,0,IMPRIMIR!D614)","v":0},{"$f":"IF(E615=0,0,IMPRIMIR!E614)","v":0},0,0,0]
[null,{"$f":"IF(E616=0,0,IMPRIMIR!A615)","v":0},{"$f":"IF(E616=0,0,IMPRIMIR!$D$3)","v":0},0,{"$f":"IMPRIMIR!B615","v":0},{"$f":"IMPRIMIR!C615","v":0},{"$f":"IF(E616=0,0,IMPRIMIR!D615)","v":0},{"$f":"IF(E616=0,0,IMPRIMIR!E615)","v":0},0,0,0]
[null,{"$f":"IF(E617=0,0,IMPRIMIR!A616)","v":0},{"$f":"IF(E617=0,0,IMPRIMIR!$D$3)","v":0},0,{"$f":"IMPRIMIR!B616","v":0},{"$f":"IMPRIMIR!C616","v":0},{"$f":"IF(E617=0,0,IMPRIMIR!D616)","v":0},{"$f":"IF(E617=0,0,IMPRIMIR!E616)","v":0},0,0,0]
[null,{"$f":"IF(E618=0,0,IMPRIMIR!A617)","v":0},{"$f":"IF(E618=0,0,IMPRIMIR!$D$3)","v":0},0,{"$f":"IMPRIMIR!B617","v":0},{"$f":"IMPRIMIR!C617","v":0},{"$f":"IF(E618=0,0,IMPRIMIR!D617)","v":0},{"$f":"IF(E618=0,0,IMPRIMIR!E617)","v":0},0,0,0]
[null,{"$f":"IF(E619=0,0,IMPRIMIR!A618)","v":0},{"$f":"IF(E619=0,0,IMPRIMIR!$D$3)","v":0},0,{"$f":"IMPRIMIR!B618","v":0},{"$f":"IMPRIMIR!C618","v":0},{"$f":"IF(E619=0,0,IMPRIMIR!D618)","v":0},{"$f":"IF(E619=0,0,IMPRIMIR!E618)","v":0},0,0,0]
[null,{"$f":"IF(E620=0,0,IMPRIMIR!A619)","v":0},{"$f":"IF(E620=0,0,IMPRIMIR!$D$3)","v":0},0,{"$f":"IMPRIMIR!B619","v":0},{"$f":"IMPRIMIR!C619","v":0},{"$f":"IF(E620=0,0,IMPRIMIR!D619)","v":0},{"$f":"IF(E620=0,0,IMPRIMIR!E619)","v":0},0,0,0]
[null,{"$f":"IF(E621=0,0,IMPRIMIR!A620)","v":0},{"$f":"IF(E621=0,0,IMPRIMIR!$D$3)","v":0},0,{"$f":"IMPRIMIR!B620","v":0},{"$f":"IMPRIMIR!C620","v":0},{"$f":"IF(E621=0,0,IMPRIMIR!D620)","v":0},{"$f":"IF(E621=0,0,IMPRIMIR!E620)","v":0},0,0,0]
[null,{"$f":"IF(E622=0,0,IMPRIMIR!A621)","v":0},{"$f":"IF(E622=0,0,IMPRIMIR!$D$3)","v":0},0,{"$f":"IMPRIMIR!B621","v":0},{"$f":"IMPRIMIR!C621","v":0},{"$f":"IF(E622=0,0,IMPRIMIR!D621)","v":0},{"$f":"IF(E622=0,0,IMPRIMIR!E621)","v":0},0,0,0]
[null,{"$f":"IF(E623=0,0,IMPRIMIR!A622)","v":0},{"$f":"IF(E623=0,0,IMPRIMIR!$D$3)","v":0},0,{"$f":"IMPRIMIR!B622","v":0},{"$f":"IMPRIMIR!C622","v":0},{"$f":"IF(E623=0,0,IMPRIMIR!D622)","v":0},{"$f":"IF(E623=0,0,IMPRIMIR!E622)","v":0},0,0,0]
[null,{"$f":"IF(E624=0,0,IMPRIMIR!A623)","v":0},{"$f":"IF(E624=0,0,IMPRIMIR!$D$3)","v":0},0,{"$f":"IMPRIMIR!B623","v":0},{"$f":"IMPRIMIR!C623","v":0},{"$f":"IF(E624=0,0,IMPRIMIR!D623)","v":0},{"$f":"IF(E624=0,0,IMPRIMIR!E623)","v":0},0,0,0]
[null,{"$f":"IF(E625=0,0,IMPRIMIR!A624)","v":0},{"$f":"IF(E625=0,0,IMPRIMIR!$D$3)","v":0},0,{"$f":"IMPRIMIR!B624","v":0},{"$f":"IMPRIMIR!C624","v":0},{"$f":"IF(E625=0,0,IMPRIMIR!D624)","v":0},{"$f":"IF(E625=0,0,IMPRIMIR!E624)","v":0},0,0,0]
[null,{"$f":"IF(E626=0,0,IMPRIMIR!A625)","v":0},{"$f":"IF(E626=0,0,IMPRIMIR!$D$3)","v":0},0,{"$f":"IMPRIMIR!B625","v":0},{"$f":"IMPRIMIR!C625","v":0},{"$f":"IF(E626=0,0,IMPRIMIR!D625)","v":0},{"$f":"IF(E626=0,0,IMPRIMIR!E625)","v":0},0,0,0]
[null,{"$f":"IF(E627=0,0,IMPRIMIR!A626)","v":0},{"$f":"IF(E627=0,0,IMPRIMIR!$D$3)","v":0},0,{"$f":"IMPRIMIR!B626","v":0},{"$f":"IMPRIMIR!C626","v":0},{"$f":"IF(E627=0,0,IMPRIMIR!D626)","v":0},{"$f":"IF(E627=0,0,IMPRIMIR!E626)","v":0},0,0,0]
[null,{"$f":"IF(E628=0,0,IMPRIMIR!A627)","v":0},{"$f":"IF(E628=0,0,IMPRIMIR!$D$3)","v":0},0,{"$f":"IMPRIMIR!B627","v":0},{"$f":"IMPRIMIR!C627","v":0},{"$f":"IF(E628=0,0,IMPRIMIR!D627)","v":0},{"$f":"IF(E628=0,0,IMPRIMIR!E627)","v":0},0,0,0]
[null,{"$f":"IF(E629=0,0,IMPRIMIR!A628)","v":0},{"$f":"IF(E629=0,0,IMPRIMIR!$D$3)","v":0},0,{"$f":"IMPRIMIR!B628","v":0},{"$f":"IMPRIMIR!C628","v":0},{"$f":"IF(E629=0,0,IMPRIMIR!D628)","v":0},{"$f":"IF(E629=0,0,IMPRIMIR!E628)","v":0},0,0,0]
[null,{"$f":"IF(E630=0,0,IMPRIMIR!A629)","v":0},{"$f":"IF(E630=0,0,IMPRIMIR!$D$3)","v":0},0,{"$f":"IMPRIMIR!B629","v":0},{"$f":"IMPRIMIR!C629","v":0},{"$f":"IF(E630=0,0,IMPRIMIR!D629)","v":0},{"$f":"IF(E630=0,0,IMPRIMIR!E629)","v":0},0,0,0]
[null,{"$f":"IF(E631=0,0,IMPRIMIR!A630)","v":0},{"$f":"IF(E631=0,0,IMPRIMIR!$D$3)","v":0},0,{"$f":"IMPRIMIR!B630","v":0},{"$f":"IMPRIMIR!C630","v":0},{"$f":"IF(E631=0,0,IMPRIMIR!D630)","v":0},{"$f":"IF(E631=0,0,IMPRIMIR!E630)","v":0},0,0,0]
[null,{"$f":"IF(E632=0,0,IMPRIMIR!A631)","v":0},{"$f":"IF(E632=0,0,IMPRIMIR!$D$3)","v":0},0,{"$f":"IMPRIMIR!B631","v":0},{"$f":"IMPRIMIR!C631","v":0},{"$f":"IF(E632=0,0,IMPRIMIR!D631)","v":0},{"$f":"IF(E632=0,0,IMPRIMIR!E631)","v":0},0,0,0]
[null,{"$f":"IF(E633=0,0,IMPRIMIR!A632)","v":0},{"$f":"IF(E633=0,0,IMPRIMIR!$D$3)","v":0},0,{"$f":"IMPRIMIR!B632","v":0},{"$f":"IMPRIMIR!C632","v":0},{"$f":"IF(E633=0,0,IMPRIMIR!D632)","v":0},{"$f":"IF(E633=0,0,IMPRIMIR!E632)","v":0},0,0,0]
[null,{"$f":"IF(E634=0,0,IMPRIMIR!A633)","v":0},{"$f":"IF(E634=0,0,IMPRIMIR!$D$3)","v":0},0,{"$f":"IMPRIMIR!B633","v":0},{"$f":"IMPRIMIR!C633","v":0},{"$f":"IF(E634=0,0,IMPRIMIR!D633)","v":0},{"$f":"IF(E634=0,0,IMPRIMIR!E633)","v":0},0,0,0]
[null,{"$f":"IF(E635=0,0,IMPRIMIR!A634)","v":0},{"$f":"IF(E635=0,0,IMPRIMIR!$D$3)","v":0},0,{"$f":"IMPRIMIR!B634","v":0},{"$f":"IMPRIMIR!C634","v":0},{"$f":"IF(E635=0,0,IMPRIMIR!D634)","v":0},{"$f":"IF(E635=0,0,IMPRIMIR!E634)","v":0},0,0,0]
[null,{"$f":"IF(E636=0,0,IMPRIMIR!A635)","v":0},{"$f":"IF(E636=0,0,IMPRIMIR!$D$3)","v":0},0,{"$f":"IMPRIMIR!B635","v":0},{"$f":"IMPRIMIR!C635","v":0},{"$f":"IF(E636=0,0,IMPRIMIR!D635)","v":0},{"$f":"IF(E636=0,0,IMPRIMIR!E635)","v":0},0,0,0]
[null,{"$f":"IF(E637=0,0,IMPRIMIR!A636)","v":0},{"$f":"IF(E637=0,0,IMPRIMIR!$D$3)","v":0},0,{"$f":"IMPRIMIR!B636","v":0},{"$f":"IMPRIMIR!C636","v":0},{"$f":"IF(E637=0,0,IMPRIMIR!D636)","v":0},{"$f":"IF(E637=0,0,IMPRIMIR!E636)","v":0},0,0,0]
[null,{"$f":"IF(E638=0,0,IMPRIMIR!A637)","v":0},{"$f":"IF(E638=0,0,IMPRIMIR!$D$3)","v":0},0,{"$f":"IMPRIMIR!B637","v":0},{"$f":"IMPRIMIR!C637","v":0},{"$f":"IF(E638=0,0,IMPRIMIR!D637)","v":0},{"$f":"IF(E638=0,0,IMPRIMIR!E637)","v":0},0,0,0]
[null,{"$f":"IF(E639=0,0,IMPRIMIR!A638)","v":0},{"$f":"IF(E639=0,0,IMPRIMIR!$D$3)","v":0},0,{"$f":"IMPRIMIR!B638","v":0},{"$f":"IMPRIMIR!C638","v":0},{"$f":"IF(E639=0,0,IMPRIMIR!D638)","v":0},{"$f":"IF(E639=0,0,IMPRIMIR!E638)","v":0},0,0,0]
[null,{"$f":"IF(E640=0,0,IMPRIMIR!A639)","v":0},{"$f":"IF(E640=0,0,IMPRIMIR!$D$3)","v":0},{"$f":"IF(E640=\"0\",0,$G$2)","v":0},{"$f":"IMPRIMIR!B639","v":0},{"$f":"IMPRIMIR!C639","v":0},{"$f":"IF(E640=0,0,IMPRIMIR!D639)","v":0},{"$f":"IF(E640=0,0,IMPRIMIR!E639)","v":0},{"$f":"IF(E640=0,0,$G$2)","v":0},{"$f":"IF(E640=0,0,$G$4)","v":0},{"$f":"IF(E640=0,0,$G$3)","v":0}]
[null,{"$f":"IF(E641=0,0,IMPRIMIR!A640)","v":0},{"$f":"IF(E641=0,0,IMPRIMIR!$D$3)","v":0},0,{"$f":"IMPRIMIR!B640","v":0},{"$f":"IMPRIMIR!C640","v":0},{"$f":"IF(E641=0,0,IMPRIMIR!D640)","v":0},{"$f":"IF(E641=0,0,IMPRIMIR!E640)","v":0},0,0,0]
[null,{"$f":"IF(E642=0,0,IMPRIMIR!A641)","v":0},{"$f":"IF(E642=0,0,IMPRIMIR!$D$3)","v":0},0,{"$f":"IMPRIMIR!B641","v":0},{"$f":"IMPRIMIR!C641","v":0},{"$f":"IF(E642=0,0,IMPRIMIR!D641)","v":0},{"$f":"IF(E642=0,0,IMPRIMIR!E641)","v":0},0,0,0]